Build: #925 failed Scheduled

Build result summary

Details

Completed
Duration
52 seconds
Labels
None
Agent
bamboo-09.af.pivotal.io
Revision
6a9bde34811b87b5425c05068a31ff61d7e59170 6a9bde34811b87b5425c05068a31ff61d7e59170
Failing since
#919 (Changes by Spring Operator <spring-operator@users.noreply.github.com> and Josh Cummings <josh.cummings@gmail.com>)

No failed tests found, a possible compilation error occurred.

Responsible

This build has been failing since #919
No one has taken responsibility

Error summary for Default Job

The job generated some errors, drill down into the full build log for more details.

/opt/bamboo-home/xml-data/build-dir/LDAP-SIO-JOB1/core/src/test/java/org/springframework/ldap/control/SortControlDirContextProcessorTest.java:148: warning: Ber is internal proprietary API and may be removed in a future release
        ber.beginSeq(Ber.ASN_SEQUENCE | Ber.ASN_CONSTRUCTOR);
                     ^
/opt/bamboo-home/xml-data/build-dir/LDAP-SIO-JOB1/core/src/test/java/org/springframework/ldap/control/SortControlDirContextProcessorTest.java:148: warning: Ber is internal proprietary API and may be removed in a future release
        ber.beginSeq(Ber.ASN_SEQUENCE | Ber.ASN_CONSTRUCTOR);
                                        ^
/opt/bamboo-home/xml-data/build-dir/LDAP-SIO-JOB1/core/src/test/java/org/springframework/ldap/control/SortControlDirContextProcessorTest.java:151: warning: Ber is internal proprietary API and may be removed in a future release
        ber.encodeOctetString(cookie, Ber.ASN_OCTET_STR);
                                      ^
Note: Some input files use or override a deprecated API.
Note: Recompile with -Xlint:deprecation for details.
Note: Some input files use unchecked or unsafe operations.
Note: Recompile with -Xlint:unchecked for details.
32 warnings

661 tests completed, 5 failed

FAILURE: Build failed with an exception.

* What went wrong:
Execution failed for task ':spring-ldap-core:springIoJdk7Test'.
> There were failing tests. See the report at: file:///opt/bamboo-home/xml-data/build-dir/LDAP-SIO-JOB1/core/build/reports/spring-io-jdk7-tests/index.html

* Try:
Run with --info or --debug option to get more log output.

* Exception is:
org.gradle.api.tasks.TaskExecutionException: Execution failed for task ':spring-ldap-core:springIoJdk7Test'.
        at org.gradle.api.internal.tasks.execution.ExecuteActionsTaskExecuter.executeActions(ExecuteActionsTaskExecuter.java:69)
        at org.gradle.api.internal.tasks.execution.ExecuteActionsTaskExecuter.execute(ExecuteActionsTaskExecuter.java:46)
        at org.gradle.api.internal.tasks.execution.PostExecutionAnalysisTaskExecuter.execute(PostExecutionAnalysisTaskExecuter.java:35)
        at org.gradle.api.internal.tasks.execution.SkipUpToDateTaskExecuter.execute(SkipUpToDateTaskExecuter.java:64)
        at org.gradle.api.internal.tasks.execution.ValidatingTaskExecuter.execute(ValidatingTaskExecuter.java:58)
        at org.gradle.api.internal.tasks.execution.SkipEmptySourceFilesTaskExecuter.execute(SkipEmptySourceFilesTaskExecuter.java:52)
        at org.gradle.api.internal.tasks.execution.SkipTaskWithNoActionsExecuter.execute(SkipTaskWithNoActionsExecuter.java:52)
        at org.gradle.api.internal.tasks.execution.SkipOnlyIfTaskExecuter.execute(SkipOnlyIfTaskExecuter.java:53)
        at org.gradle.api.internal.tasks.execution.ExecuteAtMostOnceTaskExecuter.execute(ExecuteAtMostOnceTaskExecuter.java:43)
        at org.gradle.execution.taskgraph.DefaultTaskGraphExecuter$EventFiringTaskWorker.execute(DefaultTaskGraphExecuter.java:233)
        at org.gradle.execution.taskgraph.DefaultTaskGraphExecuter$EventFiringTaskWorker.execute(DefaultTaskGraphExecuter.java:215)
        at org.gradle.execution.taskgraph.AbstractTaskPlanExecutor$TaskExecutorWorker.processTask(AbstractTaskPlanExecutor.java:74)
        at org.gradle.execution.taskgraph.AbstractTaskPlanExecutor$TaskExecutorWorker.run(AbstractTaskPlanExecutor.java:55)
        at org.gradle.execution.taskgraph.DefaultTaskPlanExecutor.process(DefaultTaskPlanExecutor.java:32)
        at org.gradle.execution.taskgraph.DefaultTaskGraphExecuter.execute(DefaultTaskGraphExecuter.java:113)
        at org.gradle.execution.SelectedTaskExecutionAction.execute(SelectedTaskExecutionAction.java:37)
        at org.gradle.execution.DefaultBuildExecuter.execute(DefaultBuildExecuter.java:37)
        at org.gradle.execution.DefaultBuildExecuter.access$000(DefaultBuildExecuter.java:23)
        at org.gradle.execution.DefaultBuildExecuter$1.proceed(DefaultBuildExecuter.java:43)
        at org.gradle.execution.DryRunBuildExecutionAction.execute(DryRunBuildExecutionAction.java:32)
        at org.gradle.execution.DefaultBuildExecuter.execute(DefaultBuildExecuter.java:37)
        at org.gradle.execution.DefaultBuildExecuter.execute(DefaultBuildExecuter.java:30)
        at org.gradle.initialization.DefaultGradleLauncher$4.run(DefaultGradleLauncher.java:186)
        at org.gradle.internal.Factories$1.create(Factories.java:22)
        at org.gradle.internal.progress.DefaultBuildOperationExecutor.run(DefaultBuildOperationExecutor.java:91)
        at org.gradle.internal.progress.DefaultBuildOperationExecutor.run(DefaultBuildOperationExecutor.java:53)
        at org.gradle.initialization.DefaultGradleLauncher.doBuildStages(DefaultGradleLauncher.java:183)
        at org.gradle.initialization.DefaultGradleLauncher.access$200(DefaultGradleLauncher.java:33)
        at org.gradle.initialization.DefaultGradleLauncher$1.create(DefaultGradleLauncher.java:112)
        at org.gradle.initialization.DefaultGradleLauncher$1.create(DefaultGradleLauncher.java:106)
        at org.gradle.internal.progress.DefaultBuildOperationExecutor.run(DefaultBuildOperationExecutor.java:91)
        at org.gradle.internal.progress.DefaultBuildOperationExecutor.run(DefaultBuildOperationExecutor.java:63)
        at org.gradle.initialization.DefaultGradleLauncher.doBuild(DefaultGradleLauncher.java:106)
        at org.gradle.initialization.DefaultGradleLauncher.run(DefaultGradleLauncher.java:92)
        at org.gradle.launcher.exec.GradleBuildController.run(GradleBuildController.java:66)
        at org.gradle.tooling.internal.provider.ExecuteBuildActionRunner.run(ExecuteBuildActionRunner.java:28)
        at org.gradle.launcher.exec.ChainingBuildActionRunner.run(ChainingBuildActionRunner.java:35)
        at org.gradle.launcher.exec.InProcessBuildActionExecuter.execute(InProcessBuildActionExecuter.java:41)
        at org.gradle.launcher.exec.InProcessBuildActionExecuter.execute(InProcessBuildActionExecuter.java:26)
        at org.gradle.tooling.internal.provider.ContinuousBuildActionExecuter.execute(ContinuousBuildActionExecuter.java:79)
        at org.gradle.tooling.internal.provider.ContinuousBuildActionExecuter.execute(ContinuousBuildActionExecuter.java:51)
        at org.gradle.launcher.cli.RunBuildAction.run(RunBuildAction.java:51)
        at org.gradle.internal.Actions$RunnableActionAdapter.execute(Actions.java:173)
        at org.gradle.launcher.cli.CommandLineActionFactory$ParseAndBuildAction.execute(CommandLineActionFactory.java:244)
        at org.gradle.launcher.cli.CommandLineActionFactory$ParseAndBuildAction.execute(CommandLineActionFactory.java:217)
        at org.gradle.launcher.cli.JavaRuntimeValidationAction.execute(JavaRuntimeValidationAction.java:33)
        at org.gradle.launcher.cli.JavaRuntimeValidationAction.execute(JavaRuntimeValidationAction.java:24)
        at org.gradle.launcher.cli.ExceptionReportingAction.execute(ExceptionReportingAction.java:33)
        at org.gradle.launcher.cli.ExceptionReportingAction.execute(ExceptionReportingAction.java:22)
        at org.gradle.launcher.cli.CommandLineActionFactory$WithLogging.execute(CommandLineActionFactory.java:210)
        at org.gradle.launcher.cli.CommandLineActionFactory$WithLogging.execute(CommandLineActionFactory.java:174)
        at org.gradle.launcher.Main.doAction(Main.java:33)
        at org.gradle.launcher.bootstrap.EntryPoint.run(EntryPoint.java:45)
        at org.gradle.launcher.bootstrap.ProcessBootstrap.runNoExit(ProcessBootstrap.java:60)
        at org.gradle.launcher.bootstrap.ProcessBootstrap.run(ProcessBootstrap.java:37)
        at org.gradle.launcher.GradleMain.main(GradleMain.java:23)
        at org.gradle.wrapper.BootstrapMainStarter.start(BootstrapMainStarter.java:30)
        at org.gradle.wrapper.WrapperExecutor.execute(WrapperExecutor.java:129)
        at org.gradle.wrapper.GradleWrapperMain.main(GradleWrapperMain.java:61)
Caused by: org.gradle.api.GradleException: There were failing tests. See the report at: file:///opt/bamboo-home/xml-data/build-dir/LDAP-SIO-JOB1/core/build/reports/spring-io-jdk7-tests/index.html
        at org.gradle.api.tasks.testing.Test.handleTestFailures(Test.java:1239)
        at org.gradle.api.tasks.testing.Test.executeTests(Test.java:650)
        at org.gradle.internal.reflect.JavaMethod.invoke(JavaMethod.java:75)
        at org.gradle.api.internal.project.taskfactory.DefaultTaskClassInfoStore$StandardTaskAction.doExecute(DefaultTaskClassInfoStore.java:136)
        at org.gradle.api.internal.project.taskfactory.DefaultTaskClassInfoStore$StandardTaskAction.execute(DefaultTaskClassInfoStore.java:129)
        at org.gradle.api.internal.project.taskfactory.DefaultTaskClassInfoStore$StandardTaskAction.execute(DefaultTaskClassInfoStore.java:118)
        at org.gradle.api.internal.AbstractTask$TaskActionWrapper.execute(AbstractTask.java:623)
        at org.gradle.api.internal.AbstractTask$TaskActionWrapper.execute(AbstractTask.java:606)
        at org.gradle.api.internal.tasks.execution.ExecuteActionsTaskExecuter.executeAction(ExecuteActionsTaskExecuter.java:80)
        at org.gradle.api.internal.tasks.execution.ExecuteActionsTaskExecuter.executeActions(ExecuteActionsTaskExecuter.java:61)
        ... 58 more