Build: #1288 failed Scheduled

Build result summary

Details

Completed
Duration
19 seconds
Labels
None
Agent
bamboo-17.af.pivotal.io
Revision
7386107abd80dc407f6eef3daccb820fabcba64e 7386107abd80dc407f6eef3daccb820fabcba64e
Fixed in
#1304 (Changes by antoine777 <antoine.mollard777@gmail.com> and Robert Winch)
No failed test found. A possible compilation error occurred.

Responsible

No one has taken responsibility for this failure

Error summary for Default Job

The job generated some errors, drill down into the full build log for more details.

OpenJDK 64-Bit Server VM warning: ignoring option MaxPermSize=1024M; support was removed in 8.0

FAILURE: Build failed with an exception.

* What went wrong:
Could not read /opt/bamboo-home/xml-data/build-dir/LDAP-SIOB-JOB1/core/build/javacc/javacc-5.0.tar.gz.
> Not in GZIP format

* Try:
Run with --info or --debug option to get more log output.

* Exception is:
org.gradle.api.resources.ResourceException: Could not read /opt/bamboo-home/xml-data/build-dir/LDAP-SIOB-JOB1/core/build/javacc/javacc-5.0.tar.gz.
        at org.gradle.internal.resource.ResourceExceptions.readFailed(ResourceExceptions.java:36)
        at org.gradle.api.internal.file.archive.compression.GzipArchiver.read(GzipArchiver.java:59)
        at org.gradle.api.internal.file.MaybeCompressedFileResource.read(MaybeCompressedFileResource.java:55)
        at org.gradle.api.internal.file.archive.TarFileTree.visit(TarFileTree.java:71)
        at org.gradle.api.internal.file.collections.FileTreeAdapter.visit(FileTreeAdapter.java:109)
        at org.gradle.api.internal.file.AbstractFileTree$FilteredFileTreeImpl.visit(AbstractFileTree.java:141)
        at org.gradle.api.internal.file.AbstractFileTree.isEmpty(AbstractFileTree.java:49)
        at org.gradle.api.internal.file.CompositeFileCollection.isEmpty(CompositeFileCollection.java:70)
        at org.gradle.api.internal.tasks.execution.SkipEmptySourceFilesTaskExecuter.execute(SkipEmptySourceFilesTaskExecuter.java:44)
        at org.gradle.api.internal.tasks.execution.SkipTaskWithNoActionsExecuter.execute(SkipTaskWithNoActionsExecuter.java:52)
        at org.gradle.api.internal.tasks.execution.SkipOnlyIfTaskExecuter.execute(SkipOnlyIfTaskExecuter.java:53)
        at org.gradle.api.internal.tasks.execution.ExecuteAtMostOnceTaskExecuter.execute(ExecuteAtMostOnceTaskExecuter.java:43)
        at org.gradle.execution.taskgraph.DefaultTaskGraphExecuter$EventFiringTaskWorker.execute(DefaultTaskGraphExecuter.java:233)
        at org.gradle.execution.taskgraph.DefaultTaskGraphExecuter$EventFiringTaskWorker.execute(DefaultTaskGraphExecuter.java:215)
        at org.gradle.execution.taskgraph.AbstractTaskPlanExecutor$TaskExecutorWorker.processTask(AbstractTaskPlanExecutor.java:74)
        at org.gradle.execution.taskgraph.AbstractTaskPlanExecutor$TaskExecutorWorker.run(AbstractTaskPlanExecutor.java:55)
        at org.gradle.execution.taskgraph.DefaultTaskPlanExecutor.process(DefaultTaskPlanExecutor.java:32)
        at org.gradle.execution.taskgraph.DefaultTaskGraphExecuter.execute(DefaultTaskGraphExecuter.java:113)
        at org.gradle.execution.SelectedTaskExecutionAction.execute(SelectedTaskExecutionAction.java:37)
        at org.gradle.execution.DefaultBuildExecuter.execute(DefaultBuildExecuter.java:37)
        at org.gradle.execution.DefaultBuildExecuter.access$000(DefaultBuildExecuter.java:23)
        at org.gradle.execution.DefaultBuildExecuter$1.proceed(DefaultBuildExecuter.java:43)
        at org.gradle.execution.DryRunBuildExecutionAction.execute(DryRunBuildExecutionAction.java:32)
        at org.gradle.execution.DefaultBuildExecuter.execute(DefaultBuildExecuter.java:37)
        at org.gradle.execution.DefaultBuildExecuter.execute(DefaultBuildExecuter.java:30)
        at org.gradle.initialization.DefaultGradleLauncher$4.run(DefaultGradleLauncher.java:186)
        at org.gradle.internal.Factories$1.create(Factories.java:22)
        at org.gradle.internal.progress.DefaultBuildOperationExecutor.run(DefaultBuildOperationExecutor.java:91)
        at org.gradle.internal.progress.DefaultBuildOperationExecutor.run(DefaultBuildOperationExecutor.java:53)
        at org.gradle.initialization.DefaultGradleLauncher.doBuildStages(DefaultGradleLauncher.java:183)
        at org.gradle.initialization.DefaultGradleLauncher.access$200(DefaultGradleLauncher.java:33)
        at org.gradle.initialization.DefaultGradleLauncher$1.create(DefaultGradleLauncher.java:112)
        at org.gradle.initialization.DefaultGradleLauncher$1.create(DefaultGradleLauncher.java:106)
        at org.gradle.internal.progress.DefaultBuildOperationExecutor.run(DefaultBuildOperationExecutor.java:91)
        at org.gradle.internal.progress.DefaultBuildOperationExecutor.run(DefaultBuildOperationExecutor.java:63)
        at org.gradle.initialization.DefaultGradleLauncher.doBuild(DefaultGradleLauncher.java:106)
        at org.gradle.initialization.DefaultGradleLauncher.run(DefaultGradleLauncher.java:92)
        at org.gradle.launcher.exec.GradleBuildController.run(GradleBuildController.java:66)
        at org.gradle.tooling.internal.provider.ExecuteBuildActionRunner.run(ExecuteBuildActionRunner.java:28)
        at org.gradle.launcher.exec.ChainingBuildActionRunner.run(ChainingBuildActionRunner.java:35)
        at org.gradle.launcher.exec.InProcessBuildActionExecuter.execute(InProcessBuildActionExecuter.java:41)
        at org.gradle.launcher.exec.InProcessBuildActionExecuter.execute(InProcessBuildActionExecuter.java:26)
        at org.gradle.tooling.internal.provider.ContinuousBuildActionExecuter.execute(ContinuousBuildActionExecuter.java:79)
        at org.gradle.tooling.internal.provider.ContinuousBuildActionExecuter.execute(ContinuousBuildActionExecuter.java:51)
        at org.gradle.launcher.cli.RunBuildAction.run(RunBuildAction.java:51)
        at org.gradle.internal.Actions$RunnableActionAdapter.execute(Actions.java:173)
        at org.gradle.launcher.cli.CommandLineActionFactory$ParseAndBuildAction.execute(CommandLineActionFactory.java:244)
        at org.gradle.launcher.cli.CommandLineActionFactory$ParseAndBuildAction.execute(CommandLineActionFactory.java:217)
        at org.gradle.launcher.cli.JavaRuntimeValidationAction.execute(JavaRuntimeValidationAction.java:33)
        at org.gradle.launcher.cli.JavaRuntimeValidationAction.execute(JavaRuntimeValidationAction.java:24)
        at org.gradle.launcher.cli.ExceptionReportingAction.execute(ExceptionReportingAction.java:33)
        at org.gradle.launcher.cli.ExceptionReportingAction.execute(ExceptionReportingAction.java:22)
        at org.gradle.launcher.cli.CommandLineActionFactory$WithLogging.execute(CommandLineActionFactory.java:210)
        at org.gradle.launcher.cli.CommandLineActionFactory$WithLogging.execute(CommandLineActionFactory.java:174)
        at org.gradle.launcher.Main.doAction(Main.java:33)
        at org.gradle.launcher.bootstrap.EntryPoint.run(EntryPoint.java:45)
        at org.gradle.launcher.bootstrap.ProcessBootstrap.runNoExit(ProcessBootstrap.java:60)
        at org.gradle.launcher.bootstrap.ProcessBootstrap.run(ProcessBootstrap.java:37)
        at org.gradle.launcher.GradleMain.main(GradleMain.java:23)
        at org.gradle.wrapper.BootstrapMainStarter.start(BootstrapMainStarter.java:30)
        at org.gradle.wrapper.WrapperExecutor.execute(WrapperExecutor.java:129)
        at org.gradle.wrapper.GradleWrapperMain.main(GradleWrapperMain.java:61)
Caused by: java.util.zip.ZipException: Not in GZIP format
        at org.gradle.api.internal.file.archive.compression.GzipArchiver.read(GzipArchiver.java:56)
        ... 60 more