Build: #1871 failed Scheduled with changes by Rossen Stoyanchev

Build result summary

Details

Completed
Duration
1 minute
Labels
None
Agent
bamboo-04.af.pivotal.io
Revisions
Spring Mobile Repository
a402cbcaf208e24288b957f44c9984bd6e8bf064 a402cbcaf208e24288b957f44c9984bd6e8bf064
Spring Framework Repository
bd910fc62b87b052968cd5a52458159d9fb6333e bd910fc62b87b052968cd5a52458159d9fb6333e
Total tests
51
Failing since
#1862 (Scheduled with changes by 8 people)

Responsible

Code commits

Spring Framework Repository
Author Commit Message Commit date
Rossen Stoyanchev Rossen Stoyanchev bd910fc62b87b052968cd5a52458159d9fb6333e bd910fc62b87b052968cd5a52458159d9fb6333e Fix checkstyle errors
Rossen Stoyanchev Rossen Stoyanchev 60e4649ff320c111836550750fafd2e51a6ac59d 60e4649ff320c111836550750fafd2e51a6ac59d Merge branch '5.1.x'
Rossen Stoyanchev Rossen Stoyanchev da4430e27ef13a42a47c954386a3a1f66e4f6cd2 m da4430e27ef13a42a47c954386a3a1f66e4f6cd2 BindingResult for resolved async attributes
ViewResolutionResultHandler no longer adds BindingResult objects for
async model attributes. Instead AbstractView adds them later when
those attributes are resolved to concrete values.

Closes gh-22933
Rossen Stoyanchev Rossen Stoyanchev 172afb510a7e8e0daca10753fe965b0dfb53f6f7 m 172afb510a7e8e0daca10753fe965b0dfb53f6f7 Polish AbstractView in WebFlux

Tests

Existing test failures 1
Status Test Failing since View job Duration
java.lang.AssertionError: java.lang.AssertionError: 
Expecting:
  <"http://m.app.local">
to be equal to:
  <"https://m.app.local">
ignoring whitespace differences
java.lang.AssertionError: 
Expecting:
(53 more lines...)