Build #1,139

Build: #1139 failed Scheduled

Build result summary

Details

Completed
Duration
123 minutes
Labels
None
Agent
bamboo-06.af.pivotal.io
Revision
d185444bdeed617311a02949a5733291b91f74bd d185444bdeed617311a02949a5733291b91f74bd
Total tests
4502
Fixed in
#1148 (Changes by Andy Wilkinson)

Responsible

No one has taken responsibility for this failure

Comments on Default Job

  1. Anonymous user

    Detected hung build state. Attempting to generate stack trace and terminate spawned sub-processes.

Tests

New test failures 1
Status Test View job Duration
Collapse Failed JsrPartitionHandlerTests testMapperProvidesPartitions History
Default Job < 1 sec
java.lang.AssertionError: java.lang.AssertionError: expected:<3> but was:<2>
java.lang.AssertionError: expected:<3> but was:<2>
	at org.junit.Assert.fail(Assert.java:88)
	at org.junit.Assert.failNotEquals(Assert.java:834)
	at org.junit.Assert.assertEquals(Assert.java:645)
	at org.junit.Assert.assertEquals(Assert.java:631)
	at org.springframework.batch.core.jsr.partition.JsrPartitionHandlerTests.testMapperProvidesPartitions(JsrPartitionHandlerTests.java:176)
	at sun.reflect.NativeMethodAccessorImpl.invoke0(Native Method)
(43 more lines...)