Build #1,255

Build: #1255 failed Scheduled

Build result summary

Details

Completed
Duration
36 minutes
Labels
None
Revision
be98da2079de9845622398511d43aec607b31e4b be98da2079de9845622398511d43aec607b31e4b
Total tests
12118
Failing since
#1252 (Scheduled – )

Tests

Responsible

This build has been failing since #1252
No one has taken responsibility

Tests

New test failures 2
Status Test View job Duration
Collapse Failed JdbcLockRegistryLeaderInitiatorTests testLostConnection History
Default Job 10 secs
java.lang.AssertionError: java.lang.AssertionError: 
Expected: is <true>
     but: was <false>
java.lang.AssertionError: 
Expected: is <true>
     but: was <false>
	at org.hamcrest.MatcherAssert.assertThat(MatcherAssert.java:20)
	at org.junit.Assert.assertThat(Assert.java:956)
(49 more lines...)
Collapse Failed JdbcMessageStoreChannelIntegrationTests testTransactionalSendAndReceive History
Default Job < 1 sec
java.lang.IllegalStateException: java.lang.IllegalStateException: Failed to load ApplicationContext
java.lang.IllegalStateException: Failed to load ApplicationContext
	at org.springframework.test.context.cache.DefaultCacheAwareContextLoaderDelegate.loadContext(DefaultCacheAwareContextLoaderDelegate.java:125)
	at org.springframework.test.context.support.DefaultTestContext.getApplicationContext(DefaultTestContext.java:108)
	at org.springframework.test.context.support.DependencyInjectionTestExecutionListener.injectDependencies(DependencyInjectionTestExecutionListener.java:117)
	at org.springframework.test.context.support.DependencyInjectionTestExecutionListener.prepareTestInstance(DependencyInjectionTestExecutionListener.java:83)
	at org.springframework.test.context.TestContextManager.prepareTestInstance(TestContextManager.java:246)
	at org.springframework.test.context.junit4.SpringJUnit4ClassRunner.createTest(SpringJUnit4ClassRunner.java:227)
(98 more lines...)