Build #242

Build: #242 failed Child of PLATFORM-PUB2-458

Build result summary

Details

Completed
Duration
87 minutes
Labels
None
Revision
98b072f020a012f21731a1d2f7c45ab55792778f 98b072f020a012f21731a1d2f7c45ab55792778f
Total tests
24464

Tests

Responsible

No one has taken responsibility for this failure

Tests

New test failures 1
Status Test View job Duration
Collapse Failed TimerTests (Java 8) verifyPause (Java 8) History
Default Job 2 secs
java.lang.AssertionError: java.lang.AssertionError
java.lang.AssertionError
	at org.junit.Assert.fail(Assert.java:86)
	at org.junit.Assert.assertTrue(Assert.java:41)
	at org.junit.Assert.assertTrue(Assert.java:52)
	at reactor.fn.timer.TimerTests.verifyPause(TimerTests.java:60)
	at sun.reflect.NativeMethodAccessorImpl.invoke0(Native Method)
	at sun.reflect.NativeMethodAccessorImpl.invoke(NativeMethodAccessorImpl.java:62)
(40 more lines...)