Build #973

Build: #973 failed Scheduled

Build result summary

Details

Completed
Duration
151 minutes
Labels
None
Revision
a1f0ce32d08006731cb1ccacafa0417ac362abf6 a1f0ce32d08006731cb1ccacafa0417ac362abf6
Total tests
4520
Fixed in
#974 (Scheduled)

Tests

Responsible

No one has taken responsibility for this failure

Comments on Default Job

  1. Anonymous user

    Detected hung build state. Attempting to generate stack trace and terminate spawned sub-processes.

Tests

New test failures 1
Status Test View job Duration
Collapse Failed TcpServerTests exposesZeroMQServer History
Default Job 1 min
org.junit.runners.model.TestTimedOutException: org.junit.runners.model.TestTimedOutException: test timed out after 60000 milliseconds
org.junit.runners.model.TestTimedOutException: test timed out after 60000 milliseconds
	at sun.nio.ch.EPollArrayWrapper.epollWait(Native Method)
	at sun.nio.ch.EPollArrayWrapper.poll(EPollArrayWrapper.java:269)
	at sun.nio.ch.EPollSelectorImpl.doSelect(EPollSelectorImpl.java:93)
	at sun.nio.ch.SelectorImpl.lockAndDoSelect(SelectorImpl.java:86)
	at sun.nio.ch.SelectorImpl.select(SelectorImpl.java:97)
	at zmq.Signaler.wait_event(Signaler.java:135)
(20 more lines...)