Build #973

Build: #973 failed Scheduled

Test results

  • 4,520 tests in total
  • 1 test failed
  • 1 failure is new
  • 55 tests were quarantined / skipped
  • 12 minutes taken in total.
New test failures 1
Status Test View job Duration
Collapse Failed TcpServerTests exposesZeroMQServer History
Default Job 1 min
org.junit.runners.model.TestTimedOutException: org.junit.runners.model.TestTimedOutException: test timed out after 60000 milliseconds
org.junit.runners.model.TestTimedOutException: test timed out after 60000 milliseconds
	at sun.nio.ch.EPollArrayWrapper.epollWait(Native Method)
	at sun.nio.ch.EPollArrayWrapper.poll(EPollArrayWrapper.java:269)
	at sun.nio.ch.EPollSelectorImpl.doSelect(EPollSelectorImpl.java:93)
	at sun.nio.ch.SelectorImpl.lockAndDoSelect(SelectorImpl.java:86)
	at sun.nio.ch.SelectorImpl.select(SelectorImpl.java:97)
	at zmq.Signaler.wait_event(Signaler.java:135)
(20 more lines...)
Skipped tests 55
Status Test Failing since View job
Skipped RabbitListenerAnnotationBeanPostProcessorTests concurrency History

Passing on the master branch.

Default Job
Skipped MismatchedQueueDeclarationTests testAdminFailsWithMismatchedQueue History

Passing on the master branch.

Default Job
Skipped CachingConnectionFactoryIntegrationTests hangOnClose History

Passing on the master branch.

Default Job
Skipped CachingConnectionFactoryTests testReturnsNormalCloseDeferredClose History

Passing on the master branch.

Default Job
Skipped RabbitReconnectProblemTests surviveAReconnect History

Passing on the master branch.

Default Job
Skipped SSLConnectionTests test History

Passing on the master branch.

Default Job
Skipped RabbitAdminIntegrationTests testDeclareDelayedExchange History

Passing on the master branch.

Default Job
Skipped RabbitAdminTests testRetry History

Passing on the master branch.

Default Job
Skipped RabbitManagementTemplateTests testDeleteExchange History
Default Job
Skipped SimpleBatchStrategyTests testBatchingPerf History

Passing on the master branch.

Default Job
Skipped UnackedRawIntegrationTests testOnePublishUnackedRequeued History

Passing on the master branch.

Default Job
Skipped UnackedRawIntegrationTests testFourPublishUnackedRequeued History

Passing on the master branch.

Default Job
Skipped JsrEndStateTests test History
Default Job
Skipped JobRepositoryFactoryBeanTests testTransactionAttributesForCreateMethodNullHypothesis History

Passing on the master branch.

Default Job
Skipped StepScopeClassIntegrationTests testNested History

Passing on the master branch.

Default Job
Skipped StepScopeClassIntegrationTests testSimpleValue History

Passing on the master branch.

Default Job
Skipped FaultTolerantStepFactoryBeanUnexpectedRollbackTests testTransactionException History

Passing on the master branch.

Default Job
Skipped AsyncChunkOrientedStepIntegrationTests testStatus History

Passing on the master branch.

Default Job
Skipped ChunkOrientedStepIntegrationTests testStatusForCommitFailedException History

Passing on the master branch.

Default Job
Skipped ScriptItemProcessorTests testBeanShellScriptSourceFunction History
Default Job
Skipped ScriptItemProcessorTests testBshScriptEvaluator History
Default Job
Skipped ScriptItemProcessorTests testBeanShellScriptSourceSimple History
Default Job
Skipped ConcurrentTransactionAwareProxyTests testConcurrentTransactionalList History

Passing on the master branch.

Default Job
Skipped SelectorSpec Consumers can be called using round-robin routing History
Default Job
Skipped ConsistentProcessorTests testMultipleConsumersMultipleTimes History
Default Job
Skipped UUIDUtilsTests reentrantLockWithAtomicLongPerformance History
Default Job
Skipped UUIDUtilsTests reentrantLockWithLongPerformance History
Default Job
Skipped UUIDUtilsTests timeBasedVersusRandom History
Default Job
Skipped UUIDUtilsTests synchronizedWithAtomicLongPerformance History
Default Job
Skipped UUIDUtilsTests synchronizedWithLongPerformance History
Default Job
Skipped GroovyConfigurationSpec GroovyEnvironment intercept with Stream properly History
Default Job
Skipped ClientServerHttpTests testMultipleConsumersMultipleTimes History
Default Job
Skipped ClientServerHttpTests testSingleConsumerWithThreeSession History
Default Job
Skipped ClientServerHttpTests testSingleConsumerWithTwoSession History
Default Job
Skipped ClientServerHttpTests testSingleConsumerWithTwoSessionBroadcastAfterConnect History
Default Job
Skipped ClientServerHttpTests testSingleConsumerWithOneSession History
Default Job
Skipped SmokeTests testMultipleConsumersMultipleTimes History
Default Job
Skipped SmokeTests testMultipleConsumersMultipleTimesSize History
Default Job
Skipped SpeedTests clockIntegerParseInt History
Default Job
Skipped SpeedTests clockByteBufferGetInt History
Default Job
Skipped SpeedTests clockManualDateExtraction History
Default Job
Skipped SpeedTests clockRegexExtraction History
Default Job
Skipped SpeedTests clockSimpleDateFormatParse History
Default Job
Skipped TcpServerTests test5 History
Default Job
Skipped TcpServerTests proxyTest History
Default Job
Skipped TcpServerTests wsTest History
Default Job
Skipped SyslogTcpServerTests testSyslogServer History
Default Job
Skipped SyslogTcpServerTests testTcpSyslogServer History
Default Job
Skipped SyslogTcpServerTests testExternalServer History
Default Job
Skipped StreamTests testCustomFileStream History
Default Job
Skipped StreamTests splitBugEventuallyHappens History
Default Job
Skipped StreamTests testDiamond History
Default Job
Skipped StreamTests endLessTimer History
Default Job
Skipped TaskExecutorsSpec Work queue executor is performant History
Default Job
Skipped PromiseReturnValueHandlerTests promiseReturnValueHandlerAwaitsValues History
Default Job