Build #973

Build: #973 failed

Job: Default Job failed

Stages & jobs

  1. Default Stage

Job result summary

Completed
Duration
150 minutes
Revision
a1f0ce32d08006731cb1ccacafa0417ac362abf6 a1f0ce32d08006731cb1ccacafa0417ac362abf6
Total tests
4520
Fixed in
#974 (Scheduled)

Tests

  • 4,520 tests in total
  • 1 test failed
  • 1 failure is new
  • 55 tests were quarantined / skipped
  • 12 minutes taken in total.
New test failures 1
Status Test Duration
Collapse Failed TcpServerTests exposesZeroMQServer History
1 min
org.junit.runners.model.TestTimedOutException: org.junit.runners.model.TestTimedOutException: test timed out after 60000 milliseconds
org.junit.runners.model.TestTimedOutException: test timed out after 60000 milliseconds
	at sun.nio.ch.EPollArrayWrapper.epollWait(Native Method)
	at sun.nio.ch.EPollArrayWrapper.poll(EPollArrayWrapper.java:269)
	at sun.nio.ch.EPollSelectorImpl.doSelect(EPollSelectorImpl.java:93)
	at sun.nio.ch.SelectorImpl.lockAndDoSelect(SelectorImpl.java:86)
	at sun.nio.ch.SelectorImpl.select(SelectorImpl.java:97)
	at zmq.Signaler.wait_event(Signaler.java:135)
(20 more lines...)

Error summary

The build generated some errors. See the full build log for more details.

8 warnings
warning: [options] bootstrap class path not set in conjunction with -source 1.6
/opt/bamboo-home/xml-data/build-dir/PLATFORM-COM2-JOB1/build/spring-batch/spring-batch-integration/src/main/java/org/springframework/batch/integration/chunk/JmsRedeliveredExtractor.java:20: warning: [deprecation] Header in org.springframework.integration.annotation has been deprecated
import org.springframework.integration.annotation.Header;
                                                 ^
/opt/bamboo-home/xml-data/build-dir/PLATFORM-COM2-JOB1/build/spring-batch/spring-batch-integration/src/main/java/org/springframework/batch/integration/chunk/AsynchronousFailureException.java:28: warning: [serial] serializable class AsynchronousFailureException has no definition of serialVersionUID
public class AsynchronousFailureException extends ItemWriterException {
       ^
/opt/bamboo-home/xml-data/build-dir/PLATFORM-COM2-JOB1/build/spring-batch/spring-batch-integration/src/main/java/org/springframework/batch/integration/chunk/JmsRedeliveredExtractor.java:31: warning: [deprecation] Header in org.springframework.integration.annotation has been deprecated
        public ChunkResponse extract(ChunkResponse input, @Header(JmsHeaders.REDELIVERED) boolean redelivered) {
                                                           ^
/opt/bamboo-home/xml-data/build-dir/PLATFORM-COM2-JOB1/build/spring-batch/spring-batch-integration/src/main/java/org/springframework/batch/integration/chunk/ChunkResponse.java:29: warning: [serial] serializable class ChunkResponse has no definition of serialVersionUID
public class ChunkResponse implements Serializable {
       ^
/opt/bamboo-home/xml-data/build-dir/PLATFORM-COM2-JOB1/build/spring-batch/spring-batch-integration/src/main/java/org/springframework/batch/integration/chunk/RemoteChunkHandlerFactoryBean.java:125: warning: [cast] redundant cast to TaskletStep
                Tasklet tasklet = getTasklet((TaskletStep) step);
                                             ^
/opt/bamboo-home/xml-data/build-dir/PLATFORM-COM2-JOB1/build/spring-batch/spring-batch-integration/src/main/java/org/springframework/batch/integration/chunk/ChunkRequest.java:32: warning: [serial] serializable class ChunkRequest has no definition of serialVersionUID
public class ChunkRequest<T> implements Serializable {
       ^
/opt/bamboo-home/xml-data/build-dir/PLATFORM-COM2-JOB1/build/spring-batch/spring-batch-integration/src/main/java/org/springframework/batch/integration/chunk/ChunkMessageChannelItemWriter.java:220: warning: [unchecked] unchecked cast
                Message<ChunkResponse> message = (Message<ChunkResponse>) messagingGateway.receive(replyChannel);
                                                                                                  ^
  required: Message<ChunkResponse>
  found:    Message<CAP#1>
  where CAP#1 is a fresh type-variable:
    CAP#1 extends Object from capture of ?
/opt/bamboo-home/xml-data/build-dir/PLATFORM-COM2-JOB1/build/spring-batch/spring-batch-integration/src/main/java/org/springframework/batch/integration/partition/BeanFactoryStepLocator.java:34: warning: [cast] redundant cast to Step
                return (Step) beanFactory.getBean(stepName, Step.class);
                       ^
/opt/bamboo-home/xml-data/build-dir/PLATFORM-COM2-JOB1/build/spring-batch/spring-batch-integration/src/main/java/org/springframework/batch/integration/partition/StepExecutionRequest.java:5: warning: [serial] serializable class StepExecutionRequest has no definition of serialVersionUID
public class StepExecutionRequest implements Serializable {
       ^
10 warnings
warning: [options] bootstrap class path not set in conjunction with -source 1.6
/opt/bamboo-home/xml-data/build-dir/PLATFORM-COM2-JOB1/build/spring-batch/spring-batch-test/src/main/java/org/springframework/batch/test/AbstractJobTests.java:70: warning: [dep-ann] deprecated item is not annotated with @Deprecated
public abstract class AbstractJobTests implements ApplicationContextAware {
                ^
/opt/bamboo-home/xml-data/build-dir/PLATFORM-COM2-JOB1/build/spring-batch/spring-batch-test/src/main/java/org/springframework/batch/test/DataSourceInitializer.java:101: warning: [deprecation] notNull(Object) in Assert has been deprecated
                Assert.notNull(dataSource);
                      ^
/opt/bamboo-home/xml-data/build-dir/PLATFORM-COM2-JOB1/build/spring-batch/spring-batch-test/src/main/java/org/springframework/batch/test/DataSourceInitializer.java:129: warning: [deprecation] readLines(InputStream) in IOUtils has been deprecated
                                        scripts = StringUtils.delimitedListToStringArray(stripComments(IOUtils.readLines(scriptResource
                                                                                                              ^
4 warnings
warning: [options] bootstrap class path not set in conjunction with -source 1.7
/opt/bamboo-home/xml-data/build-dir/PLATFORM-COM2-JOB1/build/spring-batch/spring-batch-integration/src/test/java/org/springframework/batch/integration/async/PollingAsyncItemProcessorMessagingGatewayTests.java:39: warning: [deprecation] Header in org.springframework.integration.annotation has been deprecated
import org.springframework.integration.annotation.Header;
                                                 ^
/opt/bamboo-home/xml-data/build-dir/PLATFORM-COM2-JOB1/build/spring-batch/spring-batch-integration/src/test/java/org/springframework/batch/integration/async/PollingAsyncItemProcessorMessagingGatewayTests.java:107: warning: [deprecation] Header in org.springframework.integration.annotation has been deprecated
                public String cat(String value, @Header(value="stepExecution.jobExecution.jobParameters.getLong('factor')", required=false) Integer input) {
                                                 ^
/opt/bamboo-home/xml-data/build-dir/PLATFORM-COM2-JOB1/build/spring-batch/spring-batch-integration/src/test/java/org/springframework/batch/integration/partition/MessageChannelPartitionHandlerTests.java:66: warning: [rawtypes] found raw type: Message
                Message message = mock(Message.class);
                ^
  missing type arguments for generic class Message<T>
  where T is a type-variable:
    T extends Object declared in interface Message
/opt/bamboo-home/xml-data/build-dir/PLATFORM-COM2-JOB1/build/spring-batch/spring-batch-integration/src/test/java/org/springframework/batch/integration/partition/MessageChannelPartitionHandlerTests.java:72: warning: [unchecked] unchecked method invocation: method thenReturn in interface OngoingStubbing is applied to given types
                when(operations.receive((PollableChannel) anyObject())).thenReturn(message);
                                                                                  ^
  required: T
  found: Message
  where T is a type-variable:
    T extends Object declared in interface OngoingStubbing
/opt/bamboo-home/xml-data/build-dir/PLATFORM-COM2-JOB1/build/spring-batch/spring-batch-integration/src/test/java/org/springframework/batch/integration/partition/MessageChannelPartitionHandlerTests.java:72: warning: [unchecked] unchecked conversion
                when(operations.receive((PollableChannel) anyObject())).thenReturn(message);
                                                                                   ^
  required: T
  found:    Message
  where T is a type-variable:
    T extends Object declared in interface OngoingStubbing
/opt/bamboo-home/xml-data/build-dir/PLATFORM-COM2-JOB1/build/spring-batch/spring-batch-integration/src/test/java/org/springframework/batch/integration/partition/MessageChannelPartitionHandlerTests.java:91: warning: [rawtypes] found raw type: Message
                Message message = mock(Message.class);
                ^
  missing type arguments for generic class Message<T>
  where T is a type-variable:
    T extends Object declared in interface Message
/opt/bamboo-home/xml-data/build-dir/PLATFORM-COM2-JOB1/build/spring-batch/spring-batch-integration/src/test/java/org/springframework/batch/integration/partition/MessageChannelPartitionHandlerTests.java:98: warning: [unchecked] unchecked method invocation: method thenReturn in interface OngoingStubbing is applied to given types
                when(operations.receive(replyChannel)).thenReturn(message);
                                                                 ^
  required: T
  found: Message
  where T is a type-variable:
    T extends Object declared in interface OngoingStubbing
/opt/bamboo-home/xml-data/build-dir/PLATFORM-COM2-JOB1/build/spring-batch/spring-batch-integration/src/test/java/org/springframework/batch/integration/partition/MessageChannelPartitionHandlerTests.java:98: warning: [unchecked] unchecked conversion
                when(operations.receive(replyChannel)).thenReturn(message);
                                                                  ^
  required: T
  found:    Message
  where T is a type-variable:
    T extends Object declared in interface OngoingStubbing
/opt/bamboo-home/xml-data/build-dir/PLATFORM-COM2-JOB1/build/spring-batch/spring-batch-integration/src/test/java/org/springframework/batch/integration/partition/MessageChannelPartitionHandlerTests.java:119: warning: [rawtypes] found raw type: Message
                Message message = mock(Message.class);
                ^
  missing type arguments for generic class Message<T>
  where T is a type-variable:
    T extends Object declared in interface Message
10 warnings
Force Stop build feature is enabled for current plan. Either Bamboo has detected the build has hung or it has been manually stopped.