Build #973

Build: #973 failed

Job: Default Job failed

Stages & jobs

  1. Default Stage

Test results

  • 4,520 tests in total
  • 1 test failed
  • 1 failure is new
  • 55 tests were quarantined / skipped
  • 12 minutes taken in total.

Build 973 has the following 1 errors: 1 new failure(s) occurred since the previous build.

New test failures 1
Status Test Duration
Collapse Failed TcpServerTests exposesZeroMQServer History
1 min
org.junit.runners.model.TestTimedOutException: org.junit.runners.model.TestTimedOutException: test timed out after 60000 milliseconds
org.junit.runners.model.TestTimedOutException: test timed out after 60000 milliseconds
	at sun.nio.ch.EPollArrayWrapper.epollWait(Native Method)
	at sun.nio.ch.EPollArrayWrapper.poll(EPollArrayWrapper.java:269)
	at sun.nio.ch.EPollSelectorImpl.doSelect(EPollSelectorImpl.java:93)
	at sun.nio.ch.SelectorImpl.lockAndDoSelect(SelectorImpl.java:86)
	at sun.nio.ch.SelectorImpl.select(SelectorImpl.java:97)
	at zmq.Signaler.wait_event(Signaler.java:135)
(20 more lines...)