Build #973

Build: #973 failed

Job: Default Job failed

Stages & jobs

  1. Default Stage

Exposes zero MQserver: Test case result

The below summarizes the result of the test "Exposes zero MQserver" in build 973 of Spring IO Platform - Compatibility - Brussels - Default Job. View test case history
Description
Exposes zero MQserver
Test class
reactor.io.net.tcp.TcpServerTests
Method
exposesZeroMQServer
Duration
1 min
Status
Failed (New Failure)

Error Log

org.junit.runners.model.TestTimedOutException: org.junit.runners.model.TestTimedOutException: test timed out after 60000 milliseconds
org.junit.runners.model.TestTimedOutException: test timed out after 60000 milliseconds
	at sun.nio.ch.EPollArrayWrapper.epollWait(Native Method)
	at sun.nio.ch.EPollArrayWrapper.poll(EPollArrayWrapper.java:269)
	at sun.nio.ch.EPollSelectorImpl.doSelect(EPollSelectorImpl.java:93)
	at sun.nio.ch.SelectorImpl.lockAndDoSelect(SelectorImpl.java:86)
	at sun.nio.ch.SelectorImpl.select(SelectorImpl.java:97)
	at zmq.Signaler.wait_event(Signaler.java:135)
	at zmq.Mailbox.recv(Mailbox.java:105)
	at zmq.Ctx.terminate(Ctx.java:190)
	at org.zeromq.ZMQ$Context.term(ZMQ.java:301)
	at org.zeromq.ZContext.destroy(ZContext.java:98)
	at reactor.io.net.impl.zmq.ZeroMQWorker.shutdown(ZeroMQWorker.java:121)
	at reactor.io.net.impl.zmq.tcp.ZeroMQTcpServer.doShutdown(ZeroMQTcpServer.java:224)
	at reactor.io.net.ReactorPeer.shutdown(ReactorPeer.java:85)
	at reactor.io.net.tcp.TcpServerTests.exposesZeroMQServer(TcpServerTests.java:417)
	at sun.reflect.NativeMethodAccessorImpl.invoke0(Native Method)
	at sun.reflect.NativeMethodAccessorImpl.invoke(NativeMethodAccessorImpl.java:62)
	at sun.reflect.DelegatingMethodAccessorImpl.invoke(DelegatingMethodAccessorImpl.java:43)
	at java.lang.reflect.Method.invoke(Method.java:498)
	at org.junit.runners.model.FrameworkMethod$1.runReflectiveCall(FrameworkMethod.java:50)
	at org.junit.internal.runners.model.ReflectiveCallable.run(ReflectiveCallable.java:12)
	at org.junit.runners.model.FrameworkMethod.invokeExplosively(FrameworkMethod.java:47)
	at org.junit.internal.runners.statements.InvokeMethod.evaluate(InvokeMethod.java:17)
	at org.junit.internal.runners.statements.FailOnTimeout$CallableStatement.call(FailOnTimeout.java:298)
	at org.junit.internal.runners.statements.FailOnTimeout$CallableStatement.call(FailOnTimeout.java:292)
	at java.util.concurrent.FutureTask.run(FutureTask.java:266)
	at java.lang.Thread.run(Thread.java:748)