Build #2,396

Build: #2396 failed Scheduled

Build result summary

Details

Completed
Duration
18 minutes
Labels
None
Agent
bamboo-04.af.pivotal.io
Revision
d185444bdeed617311a02949a5733291b91f74bd d185444bdeed617311a02949a5733291b91f74bd
Total tests
8
Failing since
#2375 (Scheduled – )
Fixed in
#2405 (Changes by Andy Wilkinson)

Responsible

This build has been failing since #2375
No one has taken responsibility

Tests

New test failures 1
Status Test View job Duration
Collapse Failed BomDependenciesTests dependenciesAreCorrect History
Default Job 50 secs
java.lang.AssertionError: Downgraded dependencies: io.vavr:vavr:     org.springframework.data:spring-data-commons:2.0.13.BUILD-SNAPSHOT wants 0.9.3 but Platform provides 0.9.2 
java.lang.AssertionError: Downgraded dependencies:
io.vavr:vavr:
    org.springframework.data:spring-data-commons:2.0.13.BUILD-SNAPSHOT wants 0.9.3 but Platform provides 0.9.2

	at org.junit.Assert.fail(Assert.java:88)
	at org.junit.Assert$fail.callStatic(Unknown Source)
	at org.codehaus.groovy.runtime.callsite.CallSiteArray.defaultCallStatic(CallSiteArray.java:56)
(32 more lines...)
Existing test failures 1
Status Test Failing since View job Duration
java.lang.AssertionError: The following projects require version updates:  Spring Framework to 5.0.12.BUILD-SNAPSHOT
java.lang.AssertionError: The following projects require version updates:
	Spring Framework to 5.0.12.BUILD-SNAPSHOT
	at org.junit.Assert.fail(Assert.java:88)
	at org.junit.Assert$fail.callStatic(Unknown Source)
	at org.codehaus.groovy.runtime.callsite.CallSiteArray.defaultCallStatic(CallSiteArray.java:56)
	at org.codehaus.groovy.runtime.callsite.AbstractCallSite.callStatic(AbstractCallSite.java:194)
	at org.codehaus.groovy.runtime.callsite.AbstractCallSite.callStatic(AbstractCallSite.java:206)
(30 more lines...)