Build #2,402

Build: #2402 failed Scheduled

Logs

The following logs have been generated by the jobs in this plan.
  • Expand all
  • Collapse all
Job Logs
Collapse Default Job Default Stage Download or View
14-Jan-2019 00:08:56 [INFO]
14-Jan-2019 00:08:56 [INFO] Spring IO Platform bill of materials ............... SUCCESS [  0.234 s]
14-Jan-2019 00:08:56 [INFO] Spring IO Platform build ........................... SUCCESS [  0.050 s]
14-Jan-2019 00:08:56 [INFO] Spring IO Platform documentation ................... SUCCESS [ 19.724 s]
14-Jan-2019 00:08:56 [INFO] Spring IO Platform integration tests ............... FAILURE [08:21 min]
14-Jan-2019 00:08:56 [INFO] ------------------------------------------------------------------------
14-Jan-2019 00:08:56 [INFO] BUILD FAILURE
14-Jan-2019 00:08:56 [INFO] ------------------------------------------------------------------------
14-Jan-2019 00:08:56 [INFO] Total time: 08:45 min
14-Jan-2019 00:08:56 [INFO] Finished at: 2019-01-14T00:08:56Z
14-Jan-2019 00:08:56 [INFO] Final Memory: 86M/1478M
14-Jan-2019 00:08:56 [INFO] ------------------------------------------------------------------------
14-Jan-2019 00:08:56 [ERROR] Failed to execute goal org.apache.maven.plugins:maven-surefire-plugin:2.12.4:test (default-test) on project platform-tests: There are test failures.
14-Jan-2019 00:08:56 [ERROR]
14-Jan-2019 00:08:56 [ERROR] Please refer to /opt/bamboo-home/xml-data/build-dir/PLATFORM-PUB-JOB1/platform-tests/target/surefire-reports for the individual test results.
14-Jan-2019 00:08:56 [ERROR] -> [Help 1]
14-Jan-2019 00:08:56 [ERROR]
14-Jan-2019 00:08:56 [ERROR] To see the full stack trace of the errors, re-run Maven with the -e switch.
14-Jan-2019 00:08:56 [ERROR] Re-run Maven using the -X switch to enable full debug logging.
14-Jan-2019 00:08:56 [ERROR]
14-Jan-2019 00:08:56 [ERROR] For more information about the errors and possible solutions, please read the following articles:
14-Jan-2019 00:08:56 [ERROR] [Help 1] http://cwiki.apache.org/confluence/display/MAVEN/MojoFailureException
14-Jan-2019 00:08:56 [ERROR]
14-Jan-2019 00:08:56 [ERROR] After correcting the problems, you can resume the build with the command
14-Jan-2019 00:08:56 [ERROR]   mvn <goals> -rf :platform-tests