Build #2,402

Build: #2402 failed Scheduled

Test results

  • 8 tests in total
  • 2 tests failed
  • 8 minutes taken in total.
Existing test failures 2
Status Test Failing since View job Duration
java.lang.AssertionError: Downgraded dependencies: io.vavr:vavr:     org.springframework.data:spring-data-commons:2.0.13.BUILD-SNAPSHOT wants 0.9.3 but Platform provides 0.9.2 
java.lang.AssertionError: Downgraded dependencies:
io.vavr:vavr:
    org.springframework.data:spring-data-commons:2.0.13.BUILD-SNAPSHOT wants 0.9.3 but Platform provides 0.9.2

	at org.junit.Assert.fail(Assert.java:88)
	at org.junit.Assert$fail.callStatic(Unknown Source)
	at org.codehaus.groovy.runtime.callsite.CallSiteArray.defaultCallStatic(CallSiteArray.java:56)
(32 more lines...)
java.lang.AssertionError: The following projects require version updates:  Reactor to 3.1.14.RELEASE  Spring AMQP to 2.0.11.RELEASE  Spring Batch to 4.0.2.RELEASE  Spring Data Cassandra to 2.0.13.RELEASE  Spring Data Commons to 2.0.13.RELEASE  Spring Data Couchbase to 3.0.13.RELEASE  Spring Data Elasticsearch to 3.0.13.RELEASE  Spring Data Envers to 2.0.13.RELEASE  Spring Data GemFire to 2.0.13.RELEASE  Spring Data Geode to 2.0.13.RELEASE  Spring Data JPA to 2.0.13.RELEASE  Spring Data Key Value to 2.0.13.RELEASE  Spring Data LDAP to 2.0.13.RELEASE  Spring Data MongoDB to 2.0.13.RELEASE  Spring Data Neo4j to 5.0.13.RELEASE  Spring Data Redis to 2.0.13.RELEASE  Spring Data Rest to 3.0.13.RELEASE  Spring Data Solr to 3.0.13.RELEASE  Spring Framework to 5.0.12.RELEASE  Spring Integration to 5.0.11.RELEASE  Spring Kafka to 2.1.12.RELEASE  Spring Retry to 1.2.3.RELEASE  Spring Security to 5.0.11.RELEASE  Spring Session to 2.0.9.RELEASE  Spring Web Services to 3.0.6.RELEASE
java.lang.AssertionError: The following projects require version updates:
	Reactor to 3.1.14.RELEASE
	Spring AMQP to 2.0.11.RELEASE
	Spring Batch to 4.0.2.RELEASE
	Spring Data Cassandra to 2.0.13.RELEASE
	Spring Data Commons to 2.0.13.RELEASE
	Spring Data Couchbase to 3.0.13.RELEASE
(54 more lines...)