Build #83

Build: #83 failed Rebuilt by Violeta Georgieva

Build result summary

Details

Completed
Duration
15 seconds
Labels
None
Agent
bamboo-18.af.pivotal.io
Revision
7405466e1fd9e64be46db78d58f1536cf2896d49 7405466e1fd9e64be46db78d58f1536cf2896d49
Fixed in
#84 (Manual run by Simon Basle)
Number of retries
1
No failed test found. A possible compilation error occurred.

Responsible

No one has taken responsibility for this failure

Code commits

Author Commit Message Commit date
Simon Baslé <sbasle@vmware.com> Simon Baslé <sbasle@vmware.com> 7405466e1fd9e64be46db78d58f1536cf2896d49 7405466e1fd9e64be46db78d58f1536cf2896d49 Back to core & addons snapshots

Error summary for Reactor Kotlin Core

The job generated some errors, drill down into the full build log for more details.

Could not find test result reports in the /opt/bamboo-home/xml-data/build-dir/REACTOR-KOTLIN-JOB1 directory.
        at org.gradle.tooling.internal.provider.SessionScopeBuildActionExecuter.execute(SessionScopeBuildActionExecuter.java:68)
        at org.gradle.tooling.internal.provider.SessionScopeBuildActionExecuter.execute(SessionScopeBuildActionExecuter.java:38)
        at org.gradle.tooling.internal.provider.GradleThreadBuildActionExecuter.execute(GradleThreadBuildActionExecuter.java:37)
        at org.gradle.tooling.internal.provider.GradleThreadBuildActionExecuter.execute(GradleThreadBuildActionExecuter.java:26)
        at org.gradle.tooling.internal.provider.ParallelismConfigurationBuildActionExecuter.execute(ParallelismConfigurationBuildActionExecuter.java:43)
        at org.gradle.tooling.internal.provider.ParallelismConfigurationBuildActionExecuter.execute(ParallelismConfigurationBuildActionExecuter.java:29)
        at org.gradle.tooling.internal.provider.StartParamsValidatingActionExecuter.execute(StartParamsValidatingActionExecuter.java:60)
        at org.gradle.tooling.internal.provider.StartParamsValidatingActionExecuter.execute(StartParamsValidatingActionExecuter.java:32)
        at org.gradle.tooling.internal.provider.SessionFailureReportingActionExecuter.execute(SessionFailureReportingActionExecuter.java:55)
        at org.gradle.tooling.internal.provider.SessionFailureReportingActionExecuter.execute(SessionFailureReportingActionExecuter.java:41)
        at org.gradle.tooling.internal.provider.SetupLoggingActionExecuter.execute(SetupLoggingActionExecuter.java:48)
        at org.gradle.tooling.internal.provider.SetupLoggingActionExecuter.execute(SetupLoggingActionExecuter.java:32)
        at org.gradle.launcher.daemon.server.exec.ExecuteBuild.doBuild(ExecuteBuild.java:68)
        at org.gradle.launcher.daemon.server.exec.BuildCommandOnly.execute(BuildCommandOnly.java:37)
        at org.gradle.launcher.daemon.server.api.DaemonCommandExecution.proceed(DaemonCommandExecution.java:104)
        at org.gradle.launcher.daemon.server.exec.WatchForDisconnection.execute(WatchForDisconnection.java:39)
        at org.gradle.launcher.daemon.server.api.DaemonCommandExecution.proceed(DaemonCommandExecution.java:104)
        at org.gradle.launcher.daemon.server.exec.ResetDeprecationLogger.execute(ResetDeprecationLogger.java:27)
        at org.gradle.launcher.daemon.server.api.DaemonCommandExecution.proceed(DaemonCommandExecution.java:104)
        at org.gradle.launcher.daemon.server.exec.RequestStopIfSingleUsedDaemon.execute(RequestStopIfSingleUsedDaemon.java:35)
        at org.gradle.launcher.daemon.server.api.DaemonCommandExecution.proceed(DaemonCommandExecution.java:104)
        at org.gradle.launcher.daemon.server.exec.ForwardClientInput$2.create(ForwardClientInput.java:78)
        at org.gradle.launcher.daemon.server.exec.ForwardClientInput$2.create(ForwardClientInput.java:75)
        at org.gradle.util.Swapper.swap(Swapper.java:38)
        at org.gradle.launcher.daemon.server.exec.ForwardClientInput.execute(ForwardClientInput.java:75)
        at org.gradle.launcher.daemon.server.api.DaemonCommandExecution.proceed(DaemonCommandExecution.java:104)
        at org.gradle.launcher.daemon.server.exec.LogAndCheckHealth.execute(LogAndCheckHealth.java:50)
        at org.gradle.launcher.daemon.server.api.DaemonCommandExecution.proceed(DaemonCommandExecution.java:104)
        at org.gradle.launcher.daemon.server.exec.LogToClient.doBuild(LogToClient.java:63)
        at org.gradle.launcher.daemon.server.exec.BuildCommandOnly.execute(BuildCommandOnly.java:37)
        at org.gradle.launcher.daemon.server.api.DaemonCommandExecution.proceed(DaemonCommandExecution.java:104)
        at org.gradle.launcher.daemon.server.exec.EstablishBuildEnvironment.doBuild(EstablishBuildEnvironment.java:82)
        at org.gradle.launcher.daemon.server.exec.BuildCommandOnly.execute(BuildCommandOnly.java:37)
        at org.gradle.launcher.daemon.server.api.DaemonCommandExecution.proceed(DaemonCommandExecution.java:104)
        at org.gradle.launcher.daemon.server.exec.StartBuildOrRespondWithBusy$1.run(StartBuildOrRespondWithBusy.java:52)
        at org.gradle.launcher.daemon.server.DaemonStateCoordinator$1.run(DaemonStateCoordinator.java:297)
        at org.gradle.internal.concurrent.ExecutorPolicy$CatchAndRecordFailures.onExecute(ExecutorPolicy.java:64)
        at org.gradle.internal.concurrent.ManagedExecutorImpl$1.run(ManagedExecutorImpl.java:48)
        at org.gradle.internal.concurrent.ThreadFactoryImpl$ManagedThreadRunnable.run(ThreadFactoryImpl.java:56)
Caused by: org.gradle.api.internal.artifacts.ivyservice.DefaultLenientConfiguration$ArtifactResolveException: Could not resolve all files for configuration ':compileClasspath'.
        at org.gradle.api.internal.artifacts.configurations.DefaultConfiguration.rethrowFailure(DefaultConfiguration.java:1258)
        at org.gradle.api.internal.artifacts.configurations.DefaultConfiguration.access$2200(DefaultConfiguration.java:139)
        at org.gradle.api.internal.artifacts.configurations.DefaultConfiguration$ConfigurationFileCollection.getFiles(DefaultConfiguration.java:1233)
        at org.gradle.api.internal.artifacts.configurations.DefaultConfiguration.getFiles(DefaultConfiguration.java:491)
        at org.gradle.api.internal.artifacts.configurations.DefaultConfiguration_Decorated.getFiles(Unknown Source)
        at org.jetbrains.dokka.gradle.ConfigurationExtractor.getClasspath(ConfigurationExtractor.kt:167)
        at org.jetbrains.dokka.gradle.ConfigurationExtractor.getClasspath(ConfigurationExtractor.kt:154)
        at org.jetbrains.dokka.gradle.ConfigurationExtractor.extractFromSinglePlatform(ConfigurationExtractor.kt:42)
        at org.jetbrains.dokka.gradle.DokkaTask.collectFromSinglePlatform(DokkaTask.kt:226)
        at org.jetbrains.dokka.gradle.DokkaTask.collectConfigurations(DokkaTask.kt:185)
        at org.jetbrains.dokka.gradle.DokkaTask.getInputFiles(DokkaTask.kt:333)
        at org.gradle.api.internal.tasks.properties.bean.AbstractNestedRuntimeBeanNode$BeanPropertyValue$1$1.create(AbstractNestedRuntimeBeanNode.java:80)
        at org.gradle.util.SingleMessageLogger.whileDisabled(SingleMessageLogger.java:467)
        at org.gradle.api.internal.tasks.properties.bean.AbstractNestedRuntimeBeanNode$BeanPropertyValue$1.get(AbstractNestedRuntimeBeanNode.java:76)
        at com.google.common.base.Suppliers$NonSerializableMemoizingSupplier.get(Suppliers.java:167)
        at org.gradle.api.internal.tasks.properties.bean.AbstractNestedRuntimeBeanNode$BeanPropertyValue.call(AbstractNestedRuntimeBeanNode.java:148)
        at org.gradle.util.GUtil.uncheckedCall(GUtil.java:461)
        at org.gradle.util.DeferredUtil.unpackNestableDeferred(DeferredUtil.java:64)
        at org.gradle.api.internal.file.collections.UnpackingVisitor.add(UnpackingVisitor.java:74)
        at org.gradle.api.internal.file.collections.UnpackingVisitor.add(UnpackingVisitor.java:84)
        at org.gradle.api.internal.file.DefaultFileCollectionFactory$ResolvingFileCollection.visitContents(DefaultFileCollectionFactory.java:210)
        at org.gradle.api.internal.file.CompositeFileCollection.visitDependencies(CompositeFileCollection.java:186)
        at org.gradle.api.internal.tasks.CachingTaskDependencyResolveContext$TaskGraphImpl.getNodeValues(CachingTaskDependencyResolveContext.java:111)
        at org.gradle.internal.graph.CachingDirectedGraphWalker$GraphWithEmptyEdges.getNodeValues(CachingDirectedGraphWalker.java:213)
        at org.gradle.internal.graph.CachingDirectedGraphWalker.doSearch(CachingDirectedGraphWalker.java:121)
        at org.gradle.internal.graph.CachingDirectedGraphWalker.findValues(CachingDirectedGraphWalker.java:73)
        at org.gradle.api.internal.tasks.CachingTaskDependencyResolveContext.getDependencies(CachingTaskDependencyResolveContext.java:66)
        ... 109 more
Caused by: org.gradle.internal.resolve.ModuleVersionNotFoundException: Could not find io.projectreactor.addons:reactor-adapter:3.4.3-SNAPSHOT.
Searched in the following locations:
  - https://jcenter.bintray.com/io/projectreactor/addons/reactor-adapter/3.4.3-SNAPSHOT/maven-metadata.xml
  - https://jcenter.bintray.com/io/projectreactor/addons/reactor-adapter/3.4.3-SNAPSHOT/reactor-adapter-3.4.3-SNAPSHOT.pom
  - https://jcenter.bintray.com/io/projectreactor/addons/reactor-adapter/3.4.3-SNAPSHOT/reactor-adapter-3.4.3-SNAPSHOT.jar
  - https://repo.maven.apache.org/maven2/io/projectreactor/addons/reactor-adapter/3.4.3-SNAPSHOT/maven-metadata.xml
  - https://repo.maven.apache.org/maven2/io/projectreactor/addons/reactor-adapter/3.4.3-SNAPSHOT/reactor-adapter-3.4.3-SNAPSHOT.pom
  - https://repo.maven.apache.org/maven2/io/projectreactor/addons/reactor-adapter/3.4.3-SNAPSHOT/reactor-adapter-3.4.3-SNAPSHOT.jar
  - https://oss.sonatype.org/content/repositories/releases/io/projectreactor/addons/reactor-adapter/3.4.3-SNAPSHOT/maven-metadata.xml
  - https://oss.sonatype.org/content/repositories/releases/io/projectreactor/addons/reactor-adapter/3.4.3-SNAPSHOT/reactor-adapter-3.4.3-SNAPSHOT.pom
  - https://oss.sonatype.org/content/repositories/releases/io/projectreactor/addons/reactor-adapter/3.4.3-SNAPSHOT/reactor-adapter-3.4.3-SNAPSHOT.jar
  - https://maven-eclipse.github.io/maven/io/projectreactor/addons/reactor-adapter/3.4.3-SNAPSHOT/maven-metadata.xml
  - https://maven-eclipse.github.io/maven/io/projectreactor/addons/reactor-adapter/3.4.3-SNAPSHOT/reactor-adapter-3.4.3-SNAPSHOT.pom
  - https://maven-eclipse.github.io/maven/io/projectreactor/addons/reactor-adapter/3.4.3-SNAPSHOT/reactor-adapter-3.4.3-SNAPSHOT.jar
  - https://repo.spring.io/snapshot/io/projectreactor/addons/reactor-adapter/3.4.3-SNAPSHOT/maven-metadata.xml
  - https://repo.spring.io/snapshot/io/projectreactor/addons/reactor-adapter/3.4.3-SNAPSHOT/reactor-adapter-3.4.3-SNAPSHOT.pom
  - https://repo.spring.io/snapshot/io/projectreactor/addons/reactor-adapter/3.4.3-SNAPSHOT/reactor-adapter-3.4.3-SNAPSHOT.jar
  - https://repo.spring.io/milestone/io/projectreactor/addons/reactor-adapter/3.4.3-SNAPSHOT/maven-metadata.xml
  - https://repo.spring.io/milestone/io/projectreactor/addons/reactor-adapter/3.4.3-SNAPSHOT/reactor-adapter-3.4.3-SNAPSHOT.pom
  - https://repo.spring.io/milestone/io/projectreactor/addons/reactor-adapter/3.4.3-SNAPSHOT/reactor-adapter-3.4.3-SNAPSHOT.jar
  - https://repo.spring.io/libs-milestone/io/projectreactor/addons/reactor-adapter/3.4.3-SNAPSHOT/maven-metadata.xml
  - https://repo.spring.io/libs-milestone/io/projectreactor/addons/reactor-adapter/3.4.3-SNAPSHOT/reactor-adapter-3.4.3-SNAPSHOT.pom
  - https://repo.spring.io/libs-milestone/io/projectreactor/addons/reactor-adapter/3.4.3-SNAPSHOT/reactor-adapter-3.4.3-SNAPSHOT.jar
  - https://repo.spring.io/libs-milestone/io.projectreactor.addons/reactor-adapter/ivy-3.4.3-SNAPSHOT.xml
  - https://repo.spring.io/libs-milestone/io.projectreactor.addons/reactor-adapter/3.4.3-SNAPSHOT/reactor-adapter-3.4.3-SNAPSHOT.jar
Required by:
    project :


* Get more help at https://help.gradle.org

BUILD FAILED in 12s