Build #86

Build: #86 failed Changes by Simon Baslé <[email protected]>

Build result summary

Details

Completed
Duration
37 seconds
Labels
None
Revision
3d26c7f5eb1f0da25a6cf2f70bdd1f516554ed48 3d26c7f5eb1f0da25a6cf2f70bdd1f516554ed48
Total tests
131
Fixed in
#87 (Manual run by Simon Basle)
No failed test found. A possible compilation error occurred.

Tests

  • 0 New failures
  • 0 Existing failures
  • 0 Fixed

Responsible

No one has taken responsibility for this failure

Code commits

Author Commit Message Commit date
Simon Baslé <sbasle@vmware.com> Simon Baslé <[email protected]> 3d26c7f5eb1f0da25a6cf2f70bdd1f516554ed48 3d26c7f5eb1f0da25a6cf2f70bdd1f516554ed48 Prepare release 1.1.3
 - core is bumped to 3.4.4
 - addons is brought back to 3.4.2

Error summary for Reactor Kotlin Core

The job generated some errors, drill down into the full build log for more details.

        at org.jetbrains.dokka.gradle.DokkaTask.generate(DokkaTask.kt:177)
        at org.gradle.internal.reflect.JavaMethod.invoke(JavaMethod.java:103)
        at org.gradle.api.internal.project.taskfactory.StandardTaskAction.doExecute(StandardTaskAction.java:49)
        at org.gradle.api.internal.project.taskfactory.StandardTaskAction.execute(StandardTaskAction.java:42)
        at org.gradle.api.internal.project.taskfactory.StandardTaskAction.execute(StandardTaskAction.java:28)
        at org.gradle.api.internal.AbstractTask$TaskActionWrapper.execute(AbstractTask.java:717)
        at org.gradle.api.internal.AbstractTask$TaskActionWrapper.execute(AbstractTask.java:684)
        at org.gradle.api.internal.tasks.execution.ExecuteActionsTaskExecuter$5.run(ExecuteActionsTaskExecuter.java:476)
        at org.gradle.internal.operations.DefaultBuildOperationExecutor$RunnableBuildOperationWorker.execute(DefaultBuildOperationExecutor.java:402)
        at org.gradle.internal.operations.DefaultBuildOperationExecutor$RunnableBuildOperationWorker.execute(DefaultBuildOperationExecutor.java:394)
        at org.gradle.internal.operations.DefaultBuildOperationExecutor$1.execute(DefaultBuildOperationExecutor.java:165)
        at org.gradle.internal.operations.DefaultBuildOperationExecutor.execute(DefaultBuildOperationExecutor.java:250)
        at org.gradle.internal.operations.DefaultBuildOperationExecutor.execute(DefaultBuildOperationExecutor.java:158)
        at org.gradle.internal.operations.DefaultBuildOperationExecutor.run(DefaultBuildOperationExecutor.java:92)
        at org.gradle.internal.operations.DelegatingBuildOperationExecutor.run(DelegatingBuildOperationExecutor.java:31)
        at org.gradle.api.internal.tasks.execution.ExecuteActionsTaskExecuter.executeAction(ExecuteActionsTaskExecuter.java:461)
        at org.gradle.api.internal.tasks.execution.ExecuteActionsTaskExecuter.executeActions(ExecuteActionsTaskExecuter.java:444)
        at org.gradle.api.internal.tasks.execution.ExecuteActionsTaskExecuter.access$200(ExecuteActionsTaskExecuter.java:93)
        at org.gradle.api.internal.tasks.execution.ExecuteActionsTaskExecuter$TaskExecution.execute(ExecuteActionsTaskExecuter.java:237)
        at org.gradle.internal.execution.steps.ExecuteStep.lambda$execute$1(ExecuteStep.java:33)
        at org.gradle.internal.execution.steps.ExecuteStep.execute(ExecuteStep.java:33)
        at org.gradle.internal.execution.steps.ExecuteStep.execute(ExecuteStep.java:26)
        at org.gradle.internal.execution.steps.CleanupOutputsStep.execute(CleanupOutputsStep.java:58)
        at org.gradle.internal.execution.steps.CleanupOutputsStep.execute(CleanupOutputsStep.java:35)
        at org.gradle.internal.execution.steps.ResolveInputChangesStep.execute(ResolveInputChangesStep.java:48)
        at org.gradle.internal.execution.steps.ResolveInputChangesStep.execute(ResolveInputChangesStep.java:33)
        at org.gradle.internal.execution.steps.CancelExecutionStep.execute(CancelExecutionStep.java:39)
        at org.gradle.internal.execution.steps.TimeoutStep.executeWithoutTimeout(TimeoutStep.java:73)
        at org.gradle.internal.execution.steps.TimeoutStep.execute(TimeoutStep.java:54)
        at org.gradle.internal.execution.steps.CatchExceptionStep.execute(CatchExceptionStep.java:35)
        at org.gradle.internal.execution.steps.CreateOutputsStep.execute(CreateOutputsStep.java:51)
        at org.gradle.internal.execution.steps.SnapshotOutputsStep.execute(SnapshotOutputsStep.java:45)
        at org.gradle.internal.execution.steps.SnapshotOutputsStep.execute(SnapshotOutputsStep.java:31)
        at org.gradle.internal.execution.steps.CacheStep.executeWithoutCache(CacheStep.java:208)
        at org.gradle.internal.execution.steps.CacheStep.execute(CacheStep.java:70)
        at org.gradle.internal.execution.steps.CacheStep.execute(CacheStep.java:45)
        at org.gradle.internal.execution.steps.BroadcastChangingOutputsStep.execute(BroadcastChangingOutputsStep.java:49)
        at org.gradle.internal.execution.steps.StoreSnapshotsStep.execute(StoreSnapshotsStep.java:43)
        at org.gradle.internal.execution.steps.StoreSnapshotsStep.execute(StoreSnapshotsStep.java:32)
        at org.gradle.internal.execution.steps.RecordOutputsStep.execute(RecordOutputsStep.java:38)
        at org.gradle.internal.execution.steps.RecordOutputsStep.execute(RecordOutputsStep.java:24)
        at org.gradle.internal.execution.steps.SkipUpToDateStep.executeBecause(SkipUpToDateStep.java:96)
        at org.gradle.internal.execution.steps.SkipUpToDateStep.lambda$execute$0(SkipUpToDateStep.java:89)
        at org.gradle.internal.execution.steps.SkipUpToDateStep.execute(SkipUpToDateStep.java:54)
        at org.gradle.internal.execution.steps.SkipUpToDateStep.execute(SkipUpToDateStep.java:38)
        at org.gradle.internal.execution.steps.ResolveChangesStep.execute(ResolveChangesStep.java:76)
        at org.gradle.internal.execution.steps.ResolveChangesStep.execute(ResolveChangesStep.java:37)
        at org.gradle.internal.execution.steps.legacy.MarkSnapshottingInputsFinishedStep.execute(MarkSnapshottingInputsFinishedStep.java:36)
        at org.gradle.internal.execution.steps.legacy.MarkSnapshottingInputsFinishedStep.execute(MarkSnapshottingInputsFinishedStep.java:26)
        at org.gradle.internal.execution.steps.ResolveCachingStateStep.execute(ResolveCachingStateStep.java:90)
        at org.gradle.internal.execution.steps.ResolveCachingStateStep.execute(ResolveCachingStateStep.java:48)
        at org.gradle.internal.execution.steps.CaptureStateBeforeExecutionStep.execute(CaptureStateBeforeExecutionStep.java:69)
        at org.gradle.internal.execution.steps.CaptureStateBeforeExecutionStep.execute(CaptureStateBeforeExecutionStep.java:47)
        at org.gradle.internal.execution.impl.DefaultWorkExecutor.execute(DefaultWorkExecutor.java:33)
        at org.gradle.api.internal.tasks.execution.ExecuteActionsTaskExecuter.execute(ExecuteActionsTaskExecuter.java:140)
        ... 34 more
Caused by: java.lang.RuntimeException: Exception while loading package-list from ExternalDocumentationLinkImpl(url=https://docs.oracle.com/javase/8/docs/api/, packageListUrl=https://docs.oracle.com/javase/8/docs/api/package-list)
        at org.jetbrains.dokka.PackageListProvider.<init>(ExternalDocumentationLinkResolver.kt:59)
        at org.jetbrains.dokka.PackageListProvider$$FastClassByGuice$$fb87abb.newInstance(<generated>)
        at com.google.inject.internal.cglib.reflect.$FastConstructor.newInstance(FastConstructor.java:40)
        at com.google.inject.internal.DefaultConstructionProxyFactory$1.newInstance(DefaultConstructionProxyFactory.java:60)
        at com.google.inject.internal.ConstructorInjector.construct(ConstructorInjector.java:85)
        at com.google.inject.internal.ConstructorBindingImpl$Factory.get(ConstructorBindingImpl.java:254)
        at com.google.inject.internal.ProviderToInternalFactoryAdapter$1.call(ProviderToInternalFactoryAdapter.java:46)
        at com.google.inject.internal.InjectorImpl.callInContext(InjectorImpl.java:1031)
        at com.google.inject.internal.ProviderToInternalFactoryAdapter.get(ProviderToInternalFactoryAdapter.java:40)
        at com.google.inject.Scopes$1$1.get(Scopes.java:65)
        at com.google.inject.internal.InternalFactoryToProviderAdapter.get(InternalFactoryToProviderAdapter.java:40)
        at com.google.inject.internal.SingleParameterInjector.inject(SingleParameterInjector.java:38)
        at com.google.inject.internal.SingleParameterInjector.getAll(SingleParameterInjector.java:62)
        at com.google.inject.internal.ConstructorInjector.construct(ConstructorInjector.java:84)
        at com.google.inject.internal.ConstructorBindingImpl$Factory.get(ConstructorBindingImpl.java:254)
        at com.google.inject.internal.SingleParameterInjector.inject(SingleParameterInjector.java:38)
        at com.google.inject.internal.SingleParameterInjector.getAll(SingleParameterInjector.java:62)
        at com.google.inject.internal.ConstructorInjector.construct(ConstructorInjector.java:84)
        at com.google.inject.internal.ConstructorBindingImpl$Factory.get(ConstructorBindingImpl.java:254)
        at com.google.inject.internal.SingleParameterInjector.inject(SingleParameterInjector.java:38)
        at com.google.inject.internal.SingleParameterInjector.getAll(SingleParameterInjector.java:62)
        at com.google.inject.internal.ConstructorInjector.construct(ConstructorInjector.java:84)
        at com.google.inject.internal.ConstructorBindingImpl$Factory.get(ConstructorBindingImpl.java:254)
        at com.google.inject.internal.ProviderToInternalFactoryAdapter$1.call(ProviderToInternalFactoryAdapter.java:46)
        at com.google.inject.internal.InjectorImpl.callInContext(InjectorImpl.java:1031)
        at com.google.inject.internal.ProviderToInternalFactoryAdapter.get(ProviderToInternalFactoryAdapter.java:40)
        at com.google.inject.Scopes$1$1.get(Scopes.java:65)
        at com.google.inject.internal.InternalFactoryToProviderAdapter.get(InternalFactoryToProviderAdapter.java:40)
        at com.google.inject.internal.InjectorImpl$4$1.call(InjectorImpl.java:978)
        at com.google.inject.internal.InjectorImpl.callInContext(InjectorImpl.java:1024)
        at com.google.inject.internal.InjectorImpl$4.get(InjectorImpl.java:974)
        ... 96 more
Caused by: javax.net.ssl.SSLException: Received fatal alert: internal_error
        at org.jetbrains.dokka.PackageListProvider.doOpenConnectionToReadContent(ExternalDocumentationLinkResolver.kt:75)
        at org.jetbrains.dokka.PackageListProvider.doOpenConnectionToReadContent$default(ExternalDocumentationLinkResolver.kt:68)
        at org.jetbrains.dokka.PackageListProvider.loadPackageList(ExternalDocumentationLinkResolver.kt:137)
        at org.jetbrains.dokka.PackageListProvider.<init>(ExternalDocumentationLinkResolver.kt:57)
        ... 126 more


* Get more help at https://help.gradle.org

BUILD FAILED in 34s