Build: #13 failed Manual run by Simon Basle

Build result summary

Details

Completed
Duration
46 seconds
Labels
None
Agent
bamboo-04.af.pivotal.io
Revision
cf4466a23035c1d1d4d5970d21d395e88be3efc9 cf4466a23035c1d1d4d5970d21d395e88be3efc9
Total tests
127

No failed tests found, a possible compilation error occurred.

  • 0 New failures
  • 0 Existing failures
  • 0 Fixed

Responsible

No one has taken responsibility for this failure

Error summary for Reactor Kotlin Core

The job generated some errors, drill down into the full build log for more details.

        at org.jetbrains.dokka.DokkaGeneratorKt.buildDocumentationModule(DokkaGenerator.kt:148)
        at org.jetbrains.dokka.DokkaGenerator.appendSourceModule(DokkaGenerator.kt:77)
        at org.jetbrains.dokka.DokkaGenerator.generate(DokkaGenerator.kt:40)
        at org.jetbrains.dokka.DokkaBootstrapImpl.generate(DokkaBootstrapImpl.kt:77)
        at org.jetbrains.dokka.DelegatedInvocationHandler.invoke(ProxyUtils.kt:41)
        at com.sun.proxy.$Proxy82.generate(Unknown Source)
        at org.jetbrains.dokka.gradle.DokkaTask.generate(main.kt:319)
        at org.gradle.internal.reflect.JavaMethod.invoke(JavaMethod.java:103)
        at org.gradle.api.internal.project.taskfactory.StandardTaskAction.doExecute(StandardTaskAction.java:48)
        at org.gradle.api.internal.project.taskfactory.StandardTaskAction.execute(StandardTaskAction.java:41)
        at org.gradle.api.internal.project.taskfactory.StandardTaskAction.execute(StandardTaskAction.java:28)
        at org.gradle.api.internal.AbstractTask$TaskActionWrapper.execute(AbstractTask.java:702)
        at org.gradle.api.internal.AbstractTask$TaskActionWrapper.execute(AbstractTask.java:669)
        at org.gradle.api.internal.tasks.execution.ExecuteActionsTaskExecuter$5.run(ExecuteActionsTaskExecuter.java:404)
        at org.gradle.internal.operations.DefaultBuildOperationExecutor$RunnableBuildOperationWorker.execute(DefaultBuildOperationExecutor.java:402)
        at org.gradle.internal.operations.DefaultBuildOperationExecutor$RunnableBuildOperationWorker.execute(DefaultBuildOperationExecutor.java:394)
        at org.gradle.internal.operations.DefaultBuildOperationExecutor$1.execute(DefaultBuildOperationExecutor.java:165)
        at org.gradle.internal.operations.DefaultBuildOperationExecutor.execute(DefaultBuildOperationExecutor.java:250)
        at org.gradle.internal.operations.DefaultBuildOperationExecutor.execute(DefaultBuildOperationExecutor.java:158)
        at org.gradle.internal.operations.DefaultBuildOperationExecutor.run(DefaultBuildOperationExecutor.java:92)
        at org.gradle.internal.operations.DelegatingBuildOperationExecutor.run(DelegatingBuildOperationExecutor.java:31)
        at org.gradle.api.internal.tasks.execution.ExecuteActionsTaskExecuter.executeAction(ExecuteActionsTaskExecuter.java:393)
        at org.gradle.api.internal.tasks.execution.ExecuteActionsTaskExecuter.executeActions(ExecuteActionsTaskExecuter.java:376)
        at org.gradle.api.internal.tasks.execution.ExecuteActionsTaskExecuter.access$200(ExecuteActionsTaskExecuter.java:80)
        at org.gradle.api.internal.tasks.execution.ExecuteActionsTaskExecuter$TaskExecution.execute(ExecuteActionsTaskExecuter.java:213)
        at org.gradle.internal.execution.steps.ExecuteStep.lambda$execute$1(ExecuteStep.java:33)
        at org.gradle.internal.execution.steps.ExecuteStep.execute(ExecuteStep.java:33)
        at org.gradle.internal.execution.steps.ExecuteStep.execute(ExecuteStep.java:26)
        at org.gradle.internal.execution.steps.CleanupOutputsStep.execute(CleanupOutputsStep.java:58)
        at org.gradle.internal.execution.steps.CleanupOutputsStep.execute(CleanupOutputsStep.java:35)
        at org.gradle.internal.execution.steps.ResolveInputChangesStep.execute(ResolveInputChangesStep.java:48)
        at org.gradle.internal.execution.steps.ResolveInputChangesStep.execute(ResolveInputChangesStep.java:33)
        at org.gradle.internal.execution.steps.CancelExecutionStep.execute(CancelExecutionStep.java:39)
        at org.gradle.internal.execution.steps.TimeoutStep.executeWithoutTimeout(TimeoutStep.java:73)
        at org.gradle.internal.execution.steps.TimeoutStep.execute(TimeoutStep.java:54)
        at org.gradle.internal.execution.steps.CatchExceptionStep.execute(CatchExceptionStep.java:35)
        at org.gradle.internal.execution.steps.CreateOutputsStep.execute(CreateOutputsStep.java:51)
        at org.gradle.internal.execution.steps.SnapshotOutputsStep.execute(SnapshotOutputsStep.java:45)
        at org.gradle.internal.execution.steps.SnapshotOutputsStep.execute(SnapshotOutputsStep.java:31)
        at org.gradle.internal.execution.steps.CacheStep.executeWithoutCache(CacheStep.java:201)
        at org.gradle.internal.execution.steps.CacheStep.execute(CacheStep.java:70)
        at org.gradle.internal.execution.steps.CacheStep.execute(CacheStep.java:45)
        at org.gradle.internal.execution.steps.BroadcastChangingOutputsStep.execute(BroadcastChangingOutputsStep.java:49)
        at org.gradle.internal.execution.steps.StoreSnapshotsStep.execute(StoreSnapshotsStep.java:43)
        at org.gradle.internal.execution.steps.StoreSnapshotsStep.execute(StoreSnapshotsStep.java:32)
        at org.gradle.internal.execution.steps.RecordOutputsStep.execute(RecordOutputsStep.java:38)
        at org.gradle.internal.execution.steps.RecordOutputsStep.execute(RecordOutputsStep.java:24)
        at org.gradle.internal.execution.steps.SkipUpToDateStep.executeBecause(SkipUpToDateStep.java:96)
        at org.gradle.internal.execution.steps.SkipUpToDateStep.lambda$execute$0(SkipUpToDateStep.java:89)
        at org.gradle.internal.execution.steps.SkipUpToDateStep.execute(SkipUpToDateStep.java:54)
        at org.gradle.internal.execution.steps.SkipUpToDateStep.execute(SkipUpToDateStep.java:38)
        at org.gradle.internal.execution.steps.ResolveChangesStep.execute(ResolveChangesStep.java:77)
        at org.gradle.internal.execution.steps.ResolveChangesStep.execute(ResolveChangesStep.java:37)
        at org.gradle.internal.execution.steps.legacy.MarkSnapshottingInputsFinishedStep.execute(MarkSnapshottingInputsFinishedStep.java:36)
        at org.gradle.internal.execution.steps.legacy.MarkSnapshottingInputsFinishedStep.execute(MarkSnapshottingInputsFinishedStep.java:26)
        at org.gradle.internal.execution.steps.ResolveCachingStateStep.execute(ResolveCachingStateStep.java:90)
        at org.gradle.internal.execution.steps.ResolveCachingStateStep.execute(ResolveCachingStateStep.java:48)
        at org.gradle.internal.execution.impl.DefaultWorkExecutor.execute(DefaultWorkExecutor.java:33)
        at org.gradle.api.internal.tasks.execution.ExecuteActionsTaskExecuter.execute(ExecuteActionsTaskExecuter.java:120)
        ... 126 more
Caused by: java.lang.RuntimeException: Exception while loading package-list from ExternalDocumentationLinkImpl(url=http://docs.oracle.com/javase/8/docs/api/, packageListUrl=http://docs.oracle.com/javase/8/docs/api/package-list)
        at org.jetbrains.dokka.ExternalDocumentationLinkResolver.<init>(ExternalDocumentationLinkResolver.kt:149)
        at org.jetbrains.dokka.ExternalDocumentationLinkResolver$$FastClassByGuice$$34356095.newInstance(<generated>)
        at com.google.inject.internal.cglib.reflect.$FastConstructor.newInstance(FastConstructor.java:40)
        at com.google.inject.internal.DefaultConstructionProxyFactory$1.newInstance(DefaultConstructionProxyFactory.java:60)
        at com.google.inject.internal.ConstructorInjector.construct(ConstructorInjector.java:85)
        at com.google.inject.internal.ConstructorBindingImpl$Factory.get(ConstructorBindingImpl.java:254)
        at com.google.inject.internal.ProviderToInternalFactoryAdapter$1.call(ProviderToInternalFactoryAdapter.java:46)
        at com.google.inject.internal.InjectorImpl.callInContext(InjectorImpl.java:1031)
        at com.google.inject.internal.ProviderToInternalFactoryAdapter.get(ProviderToInternalFactoryAdapter.java:40)
        at com.google.inject.Scopes$1$1.get(Scopes.java:65)
        at com.google.inject.internal.InternalFactoryToProviderAdapter.get(InternalFactoryToProviderAdapter.java:40)
        at com.google.inject.internal.SingleParameterInjector.inject(SingleParameterInjector.java:38)
        at com.google.inject.internal.SingleParameterInjector.getAll(SingleParameterInjector.java:62)
        at com.google.inject.internal.ConstructorInjector.construct(ConstructorInjector.java:84)
        at com.google.inject.internal.ConstructorBindingImpl$Factory.get(ConstructorBindingImpl.java:254)
        at com.google.inject.internal.SingleParameterInjector.inject(SingleParameterInjector.java:38)
        at com.google.inject.internal.SingleParameterInjector.getAll(SingleParameterInjector.java:62)
        at com.google.inject.internal.ConstructorInjector.construct(ConstructorInjector.java:84)
        at com.google.inject.internal.ConstructorBindingImpl$Factory.get(ConstructorBindingImpl.java:254)
        at com.google.inject.internal.ProviderToInternalFactoryAdapter$1.call(ProviderToInternalFactoryAdapter.java:46)
        at com.google.inject.internal.InjectorImpl.callInContext(InjectorImpl.java:1031)
        at com.google.inject.internal.ProviderToInternalFactoryAdapter.get(ProviderToInternalFactoryAdapter.java:40)
        at com.google.inject.Scopes$1$1.get(Scopes.java:65)
        at com.google.inject.internal.InternalFactoryToProviderAdapter.get(InternalFactoryToProviderAdapter.java:40)
        at com.google.inject.internal.InjectorImpl$4$1.call(InjectorImpl.java:978)
        at com.google.inject.internal.InjectorImpl.callInContext(InjectorImpl.java:1024)
        at com.google.inject.internal.InjectorImpl$4.get(InjectorImpl.java:974)
        ... 186 more
Caused by: java.net.SocketException: Connection reset
        at org.jetbrains.dokka.ExternalDocumentationLinkResolver.doOpenConnectionToReadContent(ExternalDocumentationLinkResolver.kt:50)
        at org.jetbrains.dokka.ExternalDocumentationLinkResolver.doOpenConnectionToReadContent$default(ExternalDocumentationLinkResolver.kt:43)
        at org.jetbrains.dokka.ExternalDocumentationLinkResolver.loadPackageList(ExternalDocumentationLinkResolver.kt:112)
        at org.jetbrains.dokka.ExternalDocumentationLinkResolver.<init>(ExternalDocumentationLinkResolver.kt:147)
        ... 212 more


* Get more help at https://help.gradle.org

BUILD FAILED in 43s