Build #16

Build: #16 failed Changes by Stephane Maldini <smaldini@pivotal.io>

Build result summary

Details

Completed
Duration
2 minutes
Labels
None
Agent
bamboo-2k16-00
Revision
6547cbaf253c9adcf762716349ee5cd99538ea1d 6547cbaf253c9adcf762716349ee5cd99538ea1d
Total tests
198
Failing since
#2 (Manual run by Stephane Maldini)
Fixed in
#41 (Manual run by Stephane Maldini)

Responsible

This build has been failing since #2
No one has taken responsibility

Code commits

Author Commit Message Commit date
Stephane Maldini &lt;smaldini@pivotal.io&gt; Stephane Maldini <smaldini@pivotal.io> 6547cbaf253c9adcf762716349ee5cd99538ea1d 6547cbaf253c9adcf762716349ee5cd99538ea1d Comment custom-header override for WS patch

Tests

New test failures 3
Status Test View job Duration
Collapse Failed HttpClientWSOperationsTest failOnServerErrorDisabledFailedNegotiation History
Netty < 1 sec
java.lang.AssertionError: java.lang.AssertionError: expectation "assertNext" failed (expected: onNext(); actual: onError(java.io.IOException: An existing connection was forcibly closed by the remote host))
java.lang.AssertionError: expectation "assertNext" failed (expected: onNext(); actual: onError(java.io.IOException: An existing connection was forcibly closed by the remote host))
	at reactor.test.DefaultStepVerifierBuilder.failPrefix(DefaultStepVerifierBuilder.java:2162)
	at reactor.test.DefaultStepVerifierBuilder.fail(DefaultStepVerifierBuilder.java:2158)
	at reactor.test.DefaultStepVerifierBuilder.lambda$consumeNextWith$1(DefaultStepVerifierBuilder.java:172)
	at reactor.test.DefaultStepVerifierBuilder$SignalEvent.test(DefaultStepVerifierBuilder.java:1900)
	at reactor.test.DefaultStepVerifierBuilder$DefaultVerifySubscriber.onSignal(DefaultStepVerifierBuilder.java:1272)
	at reactor.test.DefaultStepVerifierBuilder$DefaultVerifySubscriber.onExpectation(DefaultStepVerifierBuilder.java:1217)
(56 more lines...)
Collapse Failed HttpServerTests flushOnComplete History
Netty < 1 sec
java.lang.AssertionError: java.lang.AssertionError: expectation "expectNextSequence" failed (expected : onNext(0000000000); actual: 0000000000
; iterable: reactor.core.publisher.BlockingIterable@35e2d35f)
java.lang.AssertionError: expectation "expectNextSequence" failed (expected : onNext(0000000000); actual: 0000000000
; iterable: reactor.core.publisher.BlockingIterable@35e2d35f)
	at reactor.test.DefaultStepVerifierBuilder.failPrefix(DefaultStepVerifierBuilder.java:2162)
	at reactor.test.DefaultStepVerifierBuilder.fail(DefaultStepVerifierBuilder.java:2158)
	at reactor.test.DefaultStepVerifierBuilder$SignalSequenceEvent.test(DefaultStepVerifierBuilder.java:2095)
	at reactor.test.DefaultStepVerifierBuilder$DefaultVerifySubscriber.onSignalSequence(DefaultStepVerifierBuilder.java:1298)
(18 more lines...)
Collapse Failed HttpServerTests errorResponseAndReturn History
Netty < 1 sec
reactor.core.Exceptions$ReactiveException: reactor.core.Exceptions$ReactiveException: java.io.IOException: An existing connection was forcibly closed by the remote host
reactor.core.Exceptions$ReactiveException: java.io.IOException: An existing connection was forcibly closed by the remote host
	at reactor.core.Exceptions.propagate(Exceptions.java:315)
	at reactor.core.publisher.BlockingSingleSubscriber.blockingGet(BlockingSingleSubscriber.java:87)
	at reactor.core.publisher.Mono.block(Mono.java:1282)
	at reactor.ipc.netty.http.server.HttpServerTests.errorResponseAndReturn(HttpServerTests.java:196)
	at sun.reflect.NativeMethodAccessorImpl.invoke0(Native Method)
	at sun.reflect.NativeMethodAccessorImpl.invoke(NativeMethodAccessorImpl.java:62)
(55 more lines...)
Existing test failures 8
Status Test Failing since View job Duration
reactor.core.Exceptions$ReactiveException: reactor.core.Exceptions$ReactiveException: java.io.IOException: An existing connection was forcibly closed by the remote host
reactor.core.Exceptions$ReactiveException: java.io.IOException: An existing connection was forcibly closed by the remote host
	at reactor.core.Exceptions.propagate(Exceptions.java:315)
	at reactor.core.publisher.BlockingSingleSubscriber.blockingGet(BlockingSingleSubscriber.java:122)
	at reactor.core.publisher.Mono.block(Mono.java:1306)
	at reactor.ipc.netty.http.HttpErrorTests.test(HttpErrorTests.java:58)
	at sun.reflect.NativeMethodAccessorImpl.invoke0(Native Method)
	at sun.reflect.NativeMethodAccessorImpl.invoke(NativeMethodAccessorImpl.java:62)
(57 more lines...)
reactor.core.Exceptions$ReactiveException: reactor.core.Exceptions$ReactiveException: java.io.IOException: An existing connection was forcibly closed by the remote host
reactor.core.Exceptions$ReactiveException: java.io.IOException: An existing connection was forcibly closed by the remote host
	at reactor.core.Exceptions.propagate(Exceptions.java:315)
	at reactor.core.publisher.BlockingSingleSubscriber.blockingGet(BlockingSingleSubscriber.java:122)
	at reactor.core.publisher.Mono.block(Mono.java:1306)
	at reactor.ipc.netty.http.HttpSpec.http error with requests from clients(HttpSpec.groovy:187)
Caused by: java.io.IOException: An existing connection was forcibly closed by the remote host
	at sun.nio.ch.SocketDispatcher.write(SocketDispatcher.java:51)
(39 more lines...)
reactor.core.Exceptions$ReactiveException: reactor.core.Exceptions$ReactiveException: java.io.IOException: An existing connection was forcibly closed by the remote host
reactor.core.Exceptions$ReactiveException: java.io.IOException: An existing connection was forcibly closed by the remote host
	at reactor.core.Exceptions.propagate(Exceptions.java:315)
	at reactor.core.publisher.BlockingSingleSubscriber.blockingGet(BlockingSingleSubscriber.java:122)
	at reactor.core.publisher.Mono.block(Mono.java:1306)
	at reactor.ipc.netty.http.client.WebsocketTest.simpleSubprotocolSelected(WebsocketTest.java:284)
	at sun.reflect.NativeMethodAccessorImpl.invoke0(Native Method)
	at sun.reflect.NativeMethodAccessorImpl.invoke(NativeMethodAccessorImpl.java:62)
(58 more lines...)
reactor.core.Exceptions$ReactiveException: reactor.core.Exceptions$ReactiveException: java.io.IOException: An existing connection was forcibly closed by the remote host
reactor.core.Exceptions$ReactiveException: java.io.IOException: An existing connection was forcibly closed by the remote host
	at reactor.core.Exceptions.propagate(Exceptions.java:315)
	at reactor.core.publisher.BlockingSingleSubscriber.blockingGet(BlockingSingleSubscriber.java:122)
	at reactor.core.publisher.Mono.block(Mono.java:1306)
	at reactor.ipc.netty.http.client.WebsocketTest.anySubprotocolSelectsFirstClientProvided(WebsocketTest.java:331)
	at sun.reflect.NativeMethodAccessorImpl.invoke0(Native Method)
	at sun.reflect.NativeMethodAccessorImpl.invoke(NativeMethodAccessorImpl.java:62)
(58 more lines...)
reactor.core.Exceptions$ReactiveException: reactor.core.Exceptions$ReactiveException: java.io.IOException: An existing connection was forcibly closed by the remote host
reactor.core.Exceptions$ReactiveException: java.io.IOException: An existing connection was forcibly closed by the remote host
	at reactor.core.Exceptions.propagate(Exceptions.java:315)
	at reactor.core.publisher.BlockingSingleSubscriber.blockingGet(BlockingSingleSubscriber.java:122)
	at reactor.core.publisher.Mono.block(Mono.java:1306)
	at reactor.ipc.netty.http.client.WebsocketTest.noSubprotocolSelected(WebsocketTest.java:307)
	at sun.reflect.NativeMethodAccessorImpl.invoke0(Native Method)
	at sun.reflect.NativeMethodAccessorImpl.invoke(NativeMethodAccessorImpl.java:62)
(58 more lines...)
java.lang.AssertionError: java.lang.AssertionError: expectation "expectErrorMessage" failed (expected error message: "Invalid subprotocol. Actual: null. Expected one of: SUBPROTOCOL,OTHER"; actual message: An existing connection was forcibly closed by the remote host)
java.lang.AssertionError: expectation "expectErrorMessage" failed (expected error message: "Invalid subprotocol. Actual: null. Expected one of: SUBPROTOCOL,OTHER"; actual message: An existing connection was forcibly closed by the remote host)
	at reactor.test.DefaultStepVerifierBuilder.failPrefix(DefaultStepVerifierBuilder.java:2162)
	at reactor.test.DefaultStepVerifierBuilder.fail(DefaultStepVerifierBuilder.java:2158)
	at reactor.test.DefaultStepVerifierBuilder.lambda$expectErrorMessage$6(DefaultStepVerifierBuilder.java:272)
	at reactor.test.DefaultStepVerifierBuilder$SignalEvent.test(DefaultStepVerifierBuilder.java:1900)
	at reactor.test.DefaultStepVerifierBuilder$DefaultVerifySubscriber.onSignal(DefaultStepVerifierBuilder.java:1272)
	at reactor.test.DefaultStepVerifierBuilder$DefaultVerifySubscriber.onExpectation(DefaultStepVerifierBuilder.java:1217)
(56 more lines...)
org.junit.ComparisonFailure: org.junit.ComparisonFailure: expected:<[fals]e> but was:<[tru]e>
org.junit.ComparisonFailure: expected:<[fals]e> but was:<[tru]e>
	at sun.reflect.NativeConstructorAccessorImpl.newInstance0(Native Method)
	at sun.reflect.NativeConstructorAccessorImpl.newInstance(NativeConstructorAccessorImpl.java:62)
	at sun.reflect.DelegatingConstructorAccessorImpl.newInstance(DelegatingConstructorAccessorImpl.java:45)
	at reactor.ipc.netty.options.ClientOptionsTest.useProxy(ClientOptionsTest.java:104)
	at sun.reflect.NativeMethodAccessorImpl.invoke0(Native Method)
	at sun.reflect.NativeMethodAccessorImpl.invoke(NativeMethodAccessorImpl.java:62)
(40 more lines...)
java.lang.AssertionError: java.lang.AssertionError: latch was counted down:1
java.lang.AssertionError: latch was counted down:1
	at org.junit.Assert.fail(Assert.java:88)
	at org.junit.Assert.assertTrue(Assert.java:41)
	at reactor.ipc.netty.tcp.TcpClientTests.connectionWillRetryConnectionAttemptWhenItFails(TcpClientTests.java:239)
	at sun.reflect.NativeMethodAccessorImpl.invoke0(Native Method)
	at sun.reflect.NativeMethodAccessorImpl.invoke(NativeMethodAccessorImpl.java:62)
	at sun.reflect.DelegatingMethodAccessorImpl.invoke(DelegatingMethodAccessorImpl.java:43)
(40 more lines...)
Fixed tests 2
Status Test Failing since View job Duration
Successful WebsocketTest simpleSubprotocolServerNoSubprotocol History
Failing since build #14 (Changes by Stephane Maldini <smaldini@pivotal.io>) Netty < 1 sec
Successful WebsocketTest simpleTest History
Failing since build #15 (Changes by Stephane Maldini <smaldini@pivotal.io>) Netty < 1 sec