Build #237

Build: #237 failed Changes by Lari Hotari <lari@hotari.net>

Build result summary

Details

Completed
Duration
21 minutes
Labels
None
Agent
bamboo-2k16-00
Revision
930d748d51fa3b6129d4346fe3b062b654fd3818 930d748d51fa3b6129d4346fe3b062b654fd3818
Failing since
#212 (Changes by Violeta Georgieva)

No failed tests found, a possible compilation error occurred.

Responsible

Comments on Netty

  1. Anonymous user

    Detected hung build state. Attempting to generate stack trace and terminate spawned sub-processes... - HungBuildKiller Plugin

Code commits

Author Commit Message Commit date
Lari Hotari <lari@hotari.net> Lari Hotari <lari@hotari.net> 930d748d51fa3b6129d4346fe3b062b654fd3818 930d748d51fa3b6129d4346fe3b062b654fd3818 Fix test that broke after upgrading to Netty 4.1.25
Lari Hotari <lari@hotari.net> Lari Hotari <lari@hotari.net> 1dac93a1cad607ce1f8fd9dfa4dcaddf188cdb77 1dac93a1cad607ce1f8fd9dfa4dcaddf188cdb77 Update Netty version to 4.1.25.Final

Error summary for Netty

The job generated some errors, drill down into the full build log for more details.

Could not find test result reports in the C:\opt\bamboo-home\xml-data\build-dir\REACTOR-NETTYWIN-NETTY directory.
        at sun.reflect.NativeMethodAccessorImpl.invoke(NativeMethodAccessorImpl.java:62)
        at sun.reflect.DelegatingMethodAccessorImpl.invoke(DelegatingMethodAccessorImpl.java:43)
        at java.lang.reflect.Method.invoke(Method.java:498)
        at org.gradle.internal.dispatch.ReflectionDispatch.dispatch(ReflectionDispatch.java:35)
        at org.gradle.internal.dispatch.ReflectionDispatch.dispatch(ReflectionDispatch.java:24)
        at org.gradle.internal.dispatch.FailureHandlingDispatch.dispatch(FailureHandlingDispatch.java:29)
        at org.gradle.internal.dispatch.AsyncDispatch.dispatchMessages(AsyncDispatch.java:133)
        at org.gradle.internal.dispatch.AsyncDispatch.access$000(AsyncDispatch.java:34)
        at org.gradle.internal.dispatch.AsyncDispatch$1.run(AsyncDispatch.java:73)
        at org.gradle.internal.operations.BuildOperationIdentifierPreservingRunnable.run(BuildOperationIdentifierPreservingRunnable.java:39)
        at org.gradle.internal.concurrent.ExecutorPolicy$CatchAndRecordFailures.onExecute(ExecutorPolicy.java:63)
        at org.gradle.internal.concurrent.ManagedExecutorImpl$1.run(ManagedExecutorImpl.java:46)
        at java.util.concurrent.ThreadPoolExecutor.runWorker(ThreadPoolExecutor.java:1149)
        at java.util.concurrent.ThreadPoolExecutor$Worker.run(ThreadPoolExecutor.java:624)
        at org.gradle.internal.concurrent.ThreadFactoryImpl$ManagedThreadRunnable.run(ThreadFactoryImpl.java:55)
        at java.lang.Thread.run(Thread.java:748)
Caused by: org.gradle.api.UncheckedIOException: java.io.FileNotFoundException: C:\Users\bamboo\.gradle\caches\4.6\workerMain\cache.properties (The system cannot find the file specified)
        at org.gradle.util.GUtil.loadProperties(GUtil.java:211)
        at org.gradle.cache.internal.DefaultPersistentDirectoryCache$Initializer.requiresInitialization(DefaultPersistentDirectoryCache.java:87)
        at org.gradle.cache.internal.FixedSharedModeCrossProcessCacheAccess.open(FixedSharedModeCrossProcessCacheAccess.java:65)
        at org.gradle.cache.internal.DefaultCacheAccess.open(DefaultCacheAccess.java:141)
        at org.gradle.cache.internal.DefaultPersistentDirectoryStore.open(DefaultPersistentDirectoryStore.java:61)
        ... 28 more
Caused by: java.io.FileNotFoundException: C:\Users\bamboo\.gradle\caches\4.6\workerMain\cache.properties (The system cannot find the file specified)
        at java.io.FileInputStream.open0(Native Method)
        at java.io.FileInputStream.open(FileInputStream.java:195)
        at java.io.FileInputStream.<init>(FileInputStream.java:138)
        at org.gradle.util.GUtil.loadProperties(GUtil.java:204)
        ... 32 more
exception happened while executing the command: jstack 1376
[Ljava.lang.StackTraceElement;@23e79fe6
exception happened while executing the command: jstack 1088
[Ljava.lang.StackTraceElement;@7c6ce87a
The message received from the daemon indicates that the daemon has disappeared.
Build request sent: Build{id=b2b8f8bf-0d32-49bc-a924-b6c66a10ce16.1, currentDir=C:\opt\bamboo-home\xml-data\build-dir\REACTOR-NETTYWIN-NETTY}
Attempting to read last messages from the daemon log...
Daemon pid: 1376
  log file: C:\Users\bamboo\.gradle\daemon\4.6\daemon-1376.out.log
----- Last  20 lines from daemon log file - daemon-1376.out.log -----
        at org.gradle.internal.operations.BuildOperationIdentifierPreservingRunnable.run(BuildOperationIdentifierPreservingRunnable.java:39)
        at org.gradle.internal.concurrent.ExecutorPolicy$CatchAndRecordFailures.onExecute(ExecutorPolicy.java:63)
        at org.gradle.internal.concurrent.ManagedExecutorImpl$1.run(ManagedExecutorImpl.java:46)
        at java.util.concurrent.ThreadPoolExecutor.runWorker(ThreadPoolExecutor.java:1149)
        at java.util.concurrent.ThreadPoolExecutor$Worker.run(ThreadPoolExecutor.java:624)
        at org.gradle.internal.concurrent.ThreadFactoryImpl$ManagedThreadRunnable.run(ThreadFactoryImpl.java:55)
        at java.lang.Thread.run(Thread.java:748)
Caused by: org.gradle.api.UncheckedIOException: java.io.FileNotFoundException: C:\Users\bamboo\.gradle\caches\4.6\workerMain\cache.properties (The system cannot find the file specified)
        at org.gradle.util.GUtil.loadProperties(GUtil.java:211)
        at org.gradle.cache.internal.DefaultPersistentDirectoryCache$Initializer.requiresInitialization(DefaultPersistentDirectoryCache.java:87)
        at org.gradle.cache.internal.FixedSharedModeCrossProcessCacheAccess.open(FixedSharedModeCrossProcessCacheAccess.java:65)
        at org.gradle.cache.internal.DefaultCacheAccess.open(DefaultCacheAccess.java:141)
        at org.gradle.cache.internal.DefaultPersistentDirectoryStore.open(DefaultPersistentDirectoryStore.java:61)
        ... 28 more
Caused by: java.io.FileNotFoundException: C:\Users\bamboo\.gradle\caches\4.6\workerMain\cache.properties (The system cannot find the file specified)
        at java.io.FileInputStream.open0(Native Method)
        at java.io.FileInputStream.open(FileInputStream.java:195)
        at java.io.FileInputStream.<init>(FileInputStream.java:138)
        at org.gradle.util.GUtil.loadProperties(GUtil.java:204)
        ... 32 more
----- End of the daemon log -----


FAILURE: Build failed with an exception.

* What went wrong:
Could not dispatch a message to the daemon.

* Try:
Run with --debug option to get more log output. Run with --scan to get full insights.

* Exception is:
org.gradle.launcher.daemon.client.DaemonConnectionException: Could not dispatch a message to the daemon.
        at org.gradle.launcher.daemon.client.DaemonClientConnection.dispatch(DaemonClientConnection.java:68)
        at org.gradle.launcher.daemon.client.DaemonClientConnection.dispatch(DaemonClientConnection.java:35)
        at org.gradle.launcher.daemon.client.DaemonClientInputForwarder$ForwardTextStreamToConnection.endOfStream(DaemonClientInputForwarder.java:78)
        at org.gradle.launcher.daemon.client.InputForwarder$1.run(InputForwarder.java:95)
        at org.gradle.internal.concurrent.ExecutorPolicy$CatchAndRecordFailures.onExecute(ExecutorPolicy.java:63)
        at org.gradle.internal.concurrent.ManagedExecutorImpl$1.run(ManagedExecutorImpl.java:46)
        at java.util.concurrent.ThreadPoolExecutor.runWorker(ThreadPoolExecutor.java:1149)
        at java.util.concurrent.ThreadPoolExecutor$Worker.run(ThreadPoolExecutor.java:624)
        at org.gradle.internal.concurrent.ThreadFactoryImpl$ManagedThreadRunnable.run(ThreadFactoryImpl.java:55)
        at java.lang.Thread.run(Thread.java:748)
Caused by: org.gradle.internal.remote.internal.MessageIOException: Could not write '/127.0.0.1:49321'.
        at org.gradle.internal.remote.internal.inet.SocketConnection.flush(SocketConnection.java:134)
        at org.gradle.launcher.daemon.client.DaemonClientConnection.dispatch(DaemonClientConnection.java:59)
        ... 9 more
Caused by: java.io.IOException: An existing connection was forcibly closed by the remote host
        at sun.nio.ch.SocketDispatcher.write0(Native Method)
        at sun.nio.ch.SocketDispatcher.write(SocketDispatcher.java:51)
        at sun.nio.ch.IOUtil.writeFromNativeBuffer(IOUtil.java:93)
        at sun.nio.ch.IOUtil.write(IOUtil.java:51)
        at sun.nio.ch.SocketChannelImpl.write(SocketChannelImpl.java:471)
        at org.gradle.internal.remote.internal.inet.SocketConnection$SocketOutputStream.writeWithNonBlockingRetry(SocketConnection.java:272)
        at org.gradle.internal.remote.internal.inet.SocketConnection$SocketOutputStream.writeBufferToChannel(SocketConnection.java:260)
        at org.gradle.internal.remote.internal.inet.SocketConnection$SocketOutputStream.flush(SocketConnection.java:254)
        at org.gradle.internal.remote.internal.inet.SocketConnection.flush(SocketConnection.java:132)
        ... 10 more


* Get more help at https://help.gradle.org