Build #267

Build: #267 failed Changes by Violeta Georgieva

Build result summary

Details

Completed
Duration
2 minutes
Labels
None
Agent
bamboo-2k16-00
Revision
b2ba40f45f8ca598697e66f9cd733160e59d503d b2ba40f45f8ca598697e66f9cd733160e59d503d
Total tests
273
Failing since
#242 (Rebuilt by Violeta Georgieva)
Fixed in
#323 (Changes by Violeta Georgieva)

Responsible

Code commits

Author Commit Message Commit date
Violeta Georgieva Violeta Georgieva b2ba40f45f8ca598697e66f9cd733160e59d503d b2ba40f45f8ca598697e66f9cd733160e59d503d Merge branch '0.7.x'
Violeta Georgieva Violeta Georgieva 4278fc64b085ef27b8071c0dace56d82e11fe985 m 4278fc64b085ef27b8071c0dace56d82e11fe985 Update Netty version to 4.1.27.Final

Configuration changes

Plan configuration has changed since the last successful build. See the plan audit log for more details.

Tests

Existing test failures 1
Status Test Failing since View job Duration
reactor.netty.channel.AbortedException: reactor.netty.channel.AbortedException: Connection has been closed
reactor.netty.channel.AbortedException: Connection has been closed
	at reactor.netty.channel.ChannelOperationsHandler$PublisherSender.onError(ChannelOperationsHandler.java:596)
	at reactor.core.publisher.FluxMap$MapSubscriber.onError(FluxMap.java:120)
	at reactor.core.publisher.FluxReplay$UnboundedReplayBuffer.replayNormal(FluxReplay.java:547)
	at reactor.core.publisher.FluxReplay$UnboundedReplayBuffer.replay(FluxReplay.java:653)
	at reactor.core.publisher.ReplayProcessor.onError(ReplayProcessor.java:460)
	at reactor.core.publisher.SerializedSubscriber.onError(SerializedSubscriber.java:114)
(31 more lines...)