Build #283

Build: #283 failed Changes by Violeta Georgieva

Test results

  • 281 tests in total
  • 1 test failed
  • 26 tests were quarantined / skipped
  • 1 minute taken in total.
Existing test failures 1
Status Test Failing since View job Duration
reactor.netty.channel.AbortedException: reactor.netty.channel.AbortedException: Connection has been closed
reactor.netty.channel.AbortedException: Connection has been closed
	at reactor.netty.channel.ChannelOperationsHandler$PublisherSender.onError(ChannelOperationsHandler.java:617)
	at reactor.core.publisher.FluxMap$MapSubscriber.onError(FluxMap.java:126)
	at reactor.core.publisher.FluxReplay$UnboundedReplayBuffer.replayNormal(FluxReplay.java:547)
	at reactor.core.publisher.FluxReplay$UnboundedReplayBuffer.replay(FluxReplay.java:653)
	at reactor.core.publisher.ReplayProcessor.onError(ReplayProcessor.java:460)
	at reactor.core.publisher.SerializedSubscriber.onError(SerializedSubscriber.java:114)
(31 more lines...)
Skipped tests 26
Status Test Failing since View job
Skipped ClientServerHttpTests testSingleConsumerWithOneSession History
Netty
Skipped ClientServerHttpTests testMultipleConsumersMultipleTimes History
Netty
Skipped ClientServerHttpTests testSingleConsumerWithThreeSession History
Netty
Skipped ClientServerHttpTests testSingleConsumerWithTwoSession History
Netty
Skipped ClientServerHttpTests testSingleConsumerWithTwoSessionBroadcastAfterConnect History
Netty
Skipped HttpTests testHttp1or2Secure History
Netty
Skipped HttpTests testHttpToHttp2ClearText History
Netty
Skipped HttpTests testH2PriorKnowledge History
Netty
Skipped HttpTests testHttp1or2 History
Netty
Skipped HttpTests testH2Secure History
Netty
Skipped HttpTests testIssue395 History
Netty
Skipped HttpTests testHttpSsl History
Netty
Skipped SmokeTests testMultipleConsumersMultipleTimes History
Netty
Skipped SmokeTests testMultipleConsumersMultipleTimesSize History
Netty
Skipped HttpClientTest nonProxyHosts History
Netty
Skipped HttpClientTest postUpload History
Netty
Skipped HttpClientTest pipelined History
Netty
Skipped HttpClientTest proxy History
Netty
Skipped HttpRedirectTest okWhenRedirectsToOther History
Netty
Skipped HttpRedirectTest deadlockWhenRedirectsToSameUrl History
Netty
Skipped PostAndGetTests tryBoth History
Netty
Skipped TcpClientTests readIdleDoesNotFireWhileDataIsBeingRead History
Netty
Skipped TcpServerTests wsTest History
Netty
Skipped TcpServerTests proxyTest History
Netty
Skipped TcpServerTests test5 History
Netty
Skipped UdpServerTests supportsReceivingDatagrams History
Netty