Build #310

Build result summary

Details

Completed
Duration
2 minutes
Labels
None
Agent
bamboo-2k16-00
Revision
89b66483784322c0631d39c230ea324e25193f55 89b66483784322c0631d39c230ea324e25193f55
Total tests
288
Failing since
#242 (Rebuilt by Violeta Georgieva)
Fixed in
#323 (Changes by Violeta Georgieva)

Responsible

Code commits

Author Commit Message Commit date
quanticc <quanticc@users.noreply.github.com> quanticc <quanticc@users.noreply.github.com> 89b66483784322c0631d39c230ea324e25193f55 89b66483784322c0631d39c230ea324e25193f55 fix #223 Allow custom ws maxFramePayloadLength

Configuration changes

Plan configuration has changed since the last successful build. See the plan audit log for more details.

Tests

Existing test failures 1
Status Test Failing since View job Duration
reactor.netty.channel.AbortedException: reactor.netty.channel.AbortedException: Connection has been closed
reactor.netty.channel.AbortedException: Connection has been closed
	at reactor.netty.channel.ChannelOperationsHandler$PublisherSender.onError(ChannelOperationsHandler.java:619)
	at reactor.core.publisher.FluxMap$MapSubscriber.onError(FluxMap.java:126)
	at reactor.core.publisher.FluxReplay$UnboundedReplayBuffer.replayNormal(FluxReplay.java:547)
	at reactor.core.publisher.FluxReplay$UnboundedReplayBuffer.replay(FluxReplay.java:653)
	at reactor.core.publisher.ReplayProcessor.onError(ReplayProcessor.java:460)
	at reactor.core.publisher.SerializedSubscriber.onError(SerializedSubscriber.java:114)
(31 more lines...)
Fixed tests 1
Status Test Failing since View job Duration
Successful UdpServerTests supportsUdpMulticast History
Failing since build #309 (Changes by Violeta Georgieva) Netty < 1 sec