Build #336

Build: #336 failed Changes by Violeta Georgieva

Build result summary

Details

Completed
Duration
108 minutes
Labels
None
Agent
bamboo-2k16-00
Revision
46a1dc02df86af7cfb7e5f7a682e21b5b34901fc 46a1dc02df86af7cfb7e5f7a682e21b5b34901fc
Total tests
303
Failing since
#324 (Changes by Violeta Georgieva)
Fixed in
#343 (Rebuilt by Violeta Georgieva)

Responsible

Code commits

Author Commit Message Commit date
Violeta Georgieva Violeta Georgieva 46a1dc02df86af7cfb7e5f7a682e21b5b34901fc 46a1dc02df86af7cfb7e5f7a682e21b5b34901fc Merge branch '0.7.x'
Violeta Georgieva Violeta Georgieva dc499343bf45bc4368bbd86e6a2b37a4fc5864c2 m dc499343bf45bc4368bbd86e6a2b37a4fc5864c2 Revert Netty to 4.1.29.Final

Tests

Existing test failures 1
Status Test Failing since View job Duration
reactor.core.Exceptions$ReactiveException: reactor.core.Exceptions$ReactiveException: java.io.IOException: An established connection was aborted by the software in your host machine
reactor.core.Exceptions$ReactiveException: java.io.IOException: An established connection was aborted by the software in your host machine
	at reactor.core.Exceptions.propagate(Exceptions.java:326)
	at reactor.core.publisher.BlockingSingleSubscriber.blockingGet(BlockingSingleSubscriber.java:91)
	at reactor.core.publisher.Flux.blockLast(Flux.java:2360)
	at reactor.netty.http.client.WebsocketTest.duplexEcho(WebsocketTest.java:328)
	at sun.reflect.NativeMethodAccessorImpl.invoke0(Native Method)
	at sun.reflect.NativeMethodAccessorImpl.invoke(NativeMethodAccessorImpl.java:62)
(62 more lines...)