Build #431

Build: #431 failed Manual run by Violeta Georgieva

Build result summary

Details

Completed
Duration
2 minutes
Labels
None
Agent
bamboo-2k16-00
Revision
3aefff10c1211ec8ea03a2379cdc1ab6a8473158 3aefff10c1211ec8ea03a2379cdc1ab6a8473158
Total tests
339
Failing since
#428 (Changes by Violeta Georgieva)
Fixed in
#432 (Changes by Violeta Georgieva)

Responsible

Tests

New test failures 1
Status Test View job Duration
Collapse Failed UdpServerTests supportsUdpMulticast History
Netty 5 secs
java.lang.AssertionError: java.lang.AssertionError: latch was not counted down enough: 4 left on 6
java.lang.AssertionError: latch was not counted down enough: 4 left on 6
	at org.hamcrest.MatcherAssert.assertThat(MatcherAssert.java:26)
	at reactor.netty.udp.UdpServerTests.supportsUdpMulticast(UdpServerTests.java:199)
	at sun.reflect.NativeMethodAccessorImpl.invoke0(Native Method)
	at sun.reflect.NativeMethodAccessorImpl.invoke(NativeMethodAccessorImpl.java:62)
	at sun.reflect.DelegatingMethodAccessorImpl.invoke(DelegatingMethodAccessorImpl.java:43)
	at java.lang.reflect.Method.invoke(Method.java:498)
(43 more lines...)
Fixed tests 1
Status Test Failing since View job Duration
Successful HttpsSendFileTests sendFileAsync4096Negative History
Failing since build #430 (Rebuilt by Violeta Georgieva) Netty 4 secs