Build #445

Build: #445 failed Changes by Violeta Georgieva

Build result summary

Details

Completed
Duration
2 minutes
Labels
None
Agent
bamboo-2k16-00
Revision
3a12ca2c8117364e8e485740ccc65a21d1c9c0de 3a12ca2c8117364e8e485740ccc65a21d1c9c0de
Total tests
342
Failing since
#444 (Rebuilt by Violeta Georgieva)
Fixed in
#446 (Rebuilt by Violeta Georgieva)

Responsible

Code commits

Author Commit Message Commit date
Violeta Georgieva Violeta Georgieva 3a12ca2c8117364e8e485740ccc65a21d1c9c0de 3a12ca2c8117364e8e485740ccc65a21d1c9c0de Polish

Tests

Existing test failures 1
Status Test Failing since View job Duration
java.lang.AssertionError: java.lang.AssertionError: latch was not counted down enough: 4 left on 6
java.lang.AssertionError: latch was not counted down enough: 4 left on 6
	at org.hamcrest.MatcherAssert.assertThat(MatcherAssert.java:26)
	at reactor.netty.udp.UdpServerTests.supportsUdpMulticast(UdpServerTests.java:203)
	at sun.reflect.NativeMethodAccessorImpl.invoke0(Native Method)
	at sun.reflect.NativeMethodAccessorImpl.invoke(NativeMethodAccessorImpl.java:62)
	at sun.reflect.DelegatingMethodAccessorImpl.invoke(DelegatingMethodAccessorImpl.java:43)
	at java.lang.reflect.Method.invoke(Method.java:498)
(43 more lines...)