Build #449

Build: #449 failed Rebuilt by Violeta Georgieva

Build result summary

Details

Completed
Duration
2 minutes
Labels
None
Agent
bamboo-2k16-00
Revision
3565148829c6c80d6761a998d9b90d8b10bbae8c 3565148829c6c80d6761a998d9b90d8b10bbae8c
Total tests
347
Failing since
#447 (Changes by Violeta Georgieva)
Number of retries
2

Responsible

Code commits

Author Commit Message Commit date
Violeta Georgieva Violeta Georgieva 3565148829c6c80d6761a998d9b90d8b10bbae8c 3565148829c6c80d6761a998d9b90d8b10bbae8c fix #555 When IOException happens on the server while reading/writing treat it as client side error
Log level will be DEBUG instead of ERROR

java.io.IOException: An existing connection was forcibly closed by the remote host
        at sun.nio.ch.SocketDispatcher.read0(Native Method)
        at sun.nio.ch.SocketDispatcher.read(SocketDispatcher.java:43)
        at sun.nio.ch.IOUtil.readIntoNativeBuffer(IOUtil.java:223)
        at sun.nio.ch.IOUtil.read(IOUtil.java:192)
        at sun.nio.ch.SocketChannelImpl.read(SocketChannelImpl.java:380)
        at io.netty.buffer.PooledUnsafeDirectByteBuf.setBytes(PooledUnsafeDirectByteBuf.java:288)
        at io.netty.buffer.AbstractByteBuf.writeBytes(AbstractByteBuf.java:1132)
        at io.netty.channel.socket.nio.NioSocketChannel.doReadBytes(NioSocketChannel.java:347)
        at io.netty.channel.nio.AbstractNioByteChannel$NioByteUnsafe.read(AbstractNioByteChannel.java:148)
        at io.netty.channel.nio.NioEventLoop.processSelectedKey(NioEventLoop.java:656)
        at io.netty.channel.nio.NioEventLoop.processSelectedKeysOptimized(NioEventLoop.java:591)
        at io.netty.channel.nio.NioEventLoop.processSelectedKeys(NioEventLoop.java:508)
        at io.netty.channel.nio.NioEventLoop.run(NioEventLoop.java:470)
        at io.netty.util.concurrent.SingleThreadEventExecutor$5.run(SingleThreadEventExecutor.java:909)
        at java.lang.Thread.run(Thread.java:748)

Tests

New test failures 1
Status Test View job Duration
Collapse Failed HttpsSendFileTests sendFileAsync4096Negative History
Netty 4 secs
org.junit.ComparisonFailure: org.junit.ComparisonFailure: expected:<[101, 114, 114, 111, 114]> but was:<null>
org.junit.ComparisonFailure: expected:<[101, 114, 114, 111, 114]> but was:<null>
	at sun.reflect.NativeConstructorAccessorImpl.newInstance0(Native Method)
	at sun.reflect.NativeConstructorAccessorImpl.newInstance(NativeConstructorAccessorImpl.java:62)
	at sun.reflect.DelegatingConstructorAccessorImpl.newInstance(DelegatingConstructorAccessorImpl.java:45)
	at reactor.netty.http.server.HttpSendFileTests.doTestSendFileAsync(HttpSendFileTests.java:349)
	at reactor.netty.http.server.HttpSendFileTests.sendFileAsync4096Negative(HttpSendFileTests.java:290)
	at sun.reflect.NativeMethodAccessorImpl.invoke0(Native Method)
(45 more lines...)
Existing test failures 1
Status Test Failing since View job Duration
java.lang.AssertionError: java.lang.AssertionError: latch was not counted down enough: 4 left on 6
java.lang.AssertionError: latch was not counted down enough: 4 left on 6
	at org.hamcrest.MatcherAssert.assertThat(MatcherAssert.java:26)
	at reactor.netty.udp.UdpServerTests.supportsUdpMulticast(UdpServerTests.java:203)
	at sun.reflect.NativeMethodAccessorImpl.invoke0(Native Method)
	at sun.reflect.NativeMethodAccessorImpl.invoke(NativeMethodAccessorImpl.java:62)
	at sun.reflect.DelegatingMethodAccessorImpl.invoke(DelegatingMethodAccessorImpl.java:43)
	at java.lang.reflect.Method.invoke(Method.java:498)
(43 more lines...)