Build #452

Build: #452 failed Changes by Stephane Maldini <smaldini@pivotal.io>

Build result summary

Details

Completed
Duration
2 minutes
Labels
None
Agent
bamboo-2k16-00
Revision
830ffcd0f525b078d9aae652748798e5a45c60f5 830ffcd0f525b078d9aae652748798e5a45c60f5
Total tests
347
Failing since
#447 (Changes by Violeta Georgieva)

Responsible

Code commits

Author Commit Message Commit date
Stephane Maldini <smaldini@pivotal.io> Stephane Maldini <smaldini@pivotal.io> 830ffcd0f525b078d9aae652748798e5a45c60f5 830ffcd0f525b078d9aae652748798e5a45c60f5 Update README and core dep

Tests

Existing test failures 2
Status Test Failing since View job Duration
org.junit.ComparisonFailure: org.junit.ComparisonFailure: expected:<[101, 114, 114, 111, 114]> but was:<null>
org.junit.ComparisonFailure: expected:<[101, 114, 114, 111, 114]> but was:<null>
	at sun.reflect.NativeConstructorAccessorImpl.newInstance0(Native Method)
	at sun.reflect.NativeConstructorAccessorImpl.newInstance(NativeConstructorAccessorImpl.java:62)
	at sun.reflect.DelegatingConstructorAccessorImpl.newInstance(DelegatingConstructorAccessorImpl.java:45)
	at reactor.netty.http.server.HttpSendFileTests.doTestSendFileAsync(HttpSendFileTests.java:349)
	at reactor.netty.http.server.HttpSendFileTests.sendFileAsync4096Negative(HttpSendFileTests.java:290)
	at sun.reflect.NativeMethodAccessorImpl.invoke0(Native Method)
(45 more lines...)
java.lang.AssertionError: java.lang.AssertionError: latch was not counted down enough: 4 left on 6
java.lang.AssertionError: latch was not counted down enough: 4 left on 6
	at org.hamcrest.MatcherAssert.assertThat(MatcherAssert.java:26)
	at reactor.netty.udp.UdpServerTests.supportsUdpMulticast(UdpServerTests.java:203)
	at sun.reflect.NativeMethodAccessorImpl.invoke0(Native Method)
	at sun.reflect.NativeMethodAccessorImpl.invoke(NativeMethodAccessorImpl.java:62)
	at sun.reflect.DelegatingMethodAccessorImpl.invoke(DelegatingMethodAccessorImpl.java:43)
	at java.lang.reflect.Method.invoke(Method.java:498)
(43 more lines...)