Build #453

Build: #453 failed Changes by Violeta Georgieva

Build result summary

Details

Completed
Duration
121 minutes
Labels
None
Agent
bamboo-2k16-00
Revision
ef4b60c52adf4e56243df3b63bb9fdc1cda8c1ec ef4b60c52adf4e56243df3b63bb9fdc1cda8c1ec
Total tests
347
Failing since
#447 (Changes by Violeta Georgieva)

Responsible

Code commits

Author Commit Message Commit date
Violeta Georgieva Violeta Georgieva ef4b60c52adf4e56243df3b63bb9fdc1cda8c1ec ef4b60c52adf4e56243df3b63bb9fdc1cda8c1ec Update PooledConnectionProvider.Pool#inactiveConnections when channel closed

Tests

Existing test failures 1
Status Test Failing since View job Duration
java.lang.AssertionError: java.lang.AssertionError: latch was not counted down enough: 4 left on 6
java.lang.AssertionError: latch was not counted down enough: 4 left on 6
	at org.hamcrest.MatcherAssert.assertThat(MatcherAssert.java:26)
	at reactor.netty.udp.UdpServerTests.supportsUdpMulticast(UdpServerTests.java:203)
	at sun.reflect.NativeMethodAccessorImpl.invoke0(Native Method)
	at sun.reflect.NativeMethodAccessorImpl.invoke(NativeMethodAccessorImpl.java:62)
	at sun.reflect.DelegatingMethodAccessorImpl.invoke(DelegatingMethodAccessorImpl.java:43)
	at java.lang.reflect.Method.invoke(Method.java:498)
(43 more lines...)
Fixed tests 1
Status Test Failing since View job Duration
Successful HttpsSendFileTests sendFileAsync4096Negative History
Failing since build #449 (Rebuilt by Violeta Georgieva) Netty 4 secs