Build #539

Build: #539 failed Changes by Violeta Georgieva

Build result summary

Details

Completed
Duration
3 minutes
Labels
None
Agent
bamboo-2k16-00
Revision
73d833c03e4bcc5c82af0c82fa8b60d3423f3c37 73d833c03e4bcc5c82af0c82fa8b60d3423f3c37
Total tests
377
Failing since
#517 (Changes by Violeta Georgieva)

Responsible

Code commits

Author Commit Message Commit date
Violeta Georgieva Violeta Georgieva 73d833c03e4bcc5c82af0c82fa8b60d3423f3c37 73d833c03e4bcc5c82af0c82fa8b60d3423f3c37 Merge branch '0.8.x'
Violeta Georgieva Violeta Georgieva ad77c02f920d6494316fe3118aa42baf17c798f0 m ad77c02f920d6494316fe3118aa42baf17c798f0 When netty-codec-haproxy dependency is missing do not check the channel attribute

Tests

Existing test failures 1
Status Test Failing since View job Duration
java.lang.IllegalStateException: java.lang.IllegalStateException: Timeout on blocking read for 30000 MILLISECONDS
java.lang.IllegalStateException: Timeout on blocking read for 30000 MILLISECONDS
	at reactor.core.publisher.BlockingSingleSubscriber.blockingGet(BlockingSingleSubscriber.java:117)
	at reactor.core.publisher.Mono.block(Mono.java:1519)
	at reactor.netty.http.client.HttpClientTest.testIssue694(HttpClientTest.java:1713)
	at sun.reflect.NativeMethodAccessorImpl.invoke0(Native Method)
	at sun.reflect.NativeMethodAccessorImpl.invoke(NativeMethodAccessorImpl.java:62)
	at sun.reflect.DelegatingMethodAccessorImpl.invoke(DelegatingMethodAccessorImpl.java:43)
(44 more lines...)