Build #570

Build: #570 failed

Job: Netty failed

Stages & jobs

  1. Default Stage

Post upload: Test case result

The below summarizes the result of the test "Post upload" in build 570 of Project Reactor - Reactor Netty Window - Netty. View test case history
Description
Post upload
Test class
reactor.netty.http.client.HttpClientTest
Method
postUpload
Duration
< 1 sec
Status
Failed (New Failure)

Error Log

java.lang.AssertionError: java.lang.AssertionError: [response body reflecting request] 
Expecting:
 <"{
  "args": {}, 
  "data": "", 
  "files": {}, 
  "form": {
    "attr1": "attr2", 
    "test": "This is an UTF-8 file that is smaller than 1024 bytes.\r\nIt contains accents like \u00e9.\r\nEnd of File", 
    "test2": ""
  }, 
  "headers": {
    "Accept": "*/*", 
    "Content-Length": "582", 
    "Content-Type": "multipart/form-data; boundary=c588c6d13113e3b8", 
    "Host": "httpbin.org", 
    "User-Agent": "ReactorNetty/dev"
  }, 
  "json": null, 
  "origin": "199.184.126.3, 199.184.126.3", 
  "url": "https://httpbin.org/post"
}
">
to contain:
 <""form": {
    "attr1": "attr2", 
    "test": "This is an UTF-8 file that is smaller than 1024 bytes.\nIt contains accents like \u00e9.\nEnd of File", 
    "test2": ""
  },"> 
java.lang.AssertionError: [response body reflecting request] 
Expecting:
 <"{
  "args": {}, 
  "data": "", 
  "files": {}, 
  "form": {
    "attr1": "attr2", 
    "test": "This is an UTF-8 file that is smaller than 1024 bytes.\r\nIt contains accents like \u00e9.\r\nEnd of File", 
    "test2": ""
  }, 
  "headers": {
    "Accept": "*/*", 
    "Content-Length": "582", 
    "Content-Type": "multipart/form-data; boundary=c588c6d13113e3b8", 
    "Host": "httpbin.org", 
    "User-Agent": "ReactorNetty/dev"
  }, 
  "json": null, 
  "origin": "199.184.126.3, 199.184.126.3", 
  "url": "https://httpbin.org/post"
}
">
to contain:
 <""form": {
    "attr1": "attr2", 
    "test": "This is an UTF-8 file that is smaller than 1024 bytes.\nIt contains accents like \u00e9.\nEnd of File", 
    "test2": ""
  },"> 
	at reactor.netty.http.client.HttpClientTest.postUpload(HttpClientTest.java:348)
	at sun.reflect.NativeMethodAccessorImpl.invoke0(Native Method)
	at sun.reflect.NativeMethodAccessorImpl.invoke(NativeMethodAccessorImpl.java:62)
	at sun.reflect.DelegatingMethodAccessorImpl.invoke(DelegatingMethodAccessorImpl.java:43)
	at java.lang.reflect.Method.invoke(Method.java:498)
	at org.junit.runners.model.FrameworkMethod$1.runReflectiveCall(FrameworkMethod.java:50)
	at org.junit.internal.runners.model.ReflectiveCallable.run(ReflectiveCallable.java:12)
	at org.junit.runners.model.FrameworkMethod.invokeExplosively(FrameworkMethod.java:47)
	at org.junit.internal.runners.statements.InvokeMethod.evaluate(InvokeMethod.java:17)
	at org.junit.runners.ParentRunner.runLeaf(ParentRunner.java:325)
	at org.junit.runners.BlockJUnit4ClassRunner.runChild(BlockJUnit4ClassRunner.java:78)
	at org.junit.runners.BlockJUnit4ClassRunner.runChild(BlockJUnit4ClassRunner.java:57)
	at org.junit.runners.ParentRunner$3.run(ParentRunner.java:290)
	at org.junit.runners.ParentRunner$1.schedule(ParentRunner.java:71)
	at org.junit.runners.ParentRunner.runChildren(ParentRunner.java:288)
	at org.junit.runners.ParentRunner.access$000(ParentRunner.java:58)
	at org.junit.runners.ParentRunner$2.evaluate(ParentRunner.java:268)
	at org.junit.runners.ParentRunner.run(ParentRunner.java:363)
	at org.gradle.api.internal.tasks.testing.junit.JUnitTestClassExecutor.runTestClass(JUnitTestClassExecutor.java:110)
	at org.gradle.api.internal.tasks.testing.junit.JUnitTestClassExecutor.execute(JUnitTestClassExecutor.java:58)
	at org.gradle.api.internal.tasks.testing.junit.JUnitTestClassExecutor.execute(JUnitTestClassExecutor.java:38)
	at org.gradle.api.internal.tasks.testing.junit.AbstractJUnitTestClassProcessor.processTestClass(AbstractJUnitTestClassProcessor.java:62)
	at org.gradle.api.internal.tasks.testing.SuiteTestClassProcessor.processTestClass(SuiteTestClassProcessor.java:51)
	at sun.reflect.NativeMethodAccessorImpl.invoke0(Native Method)
	at sun.reflect.NativeMethodAccessorImpl.invoke(NativeMethodAccessorImpl.java:62)
	at sun.reflect.DelegatingMethodAccessorImpl.invoke(DelegatingMethodAccessorImpl.java:43)
	at java.lang.reflect.Method.invoke(Method.java:498)
	at org.gradle.internal.dispatch.ReflectionDispatch.dispatch(ReflectionDispatch.java:35)
	at org.gradle.internal.dispatch.ReflectionDispatch.dispatch(ReflectionDispatch.java:24)
	at org.gradle.internal.dispatch.ContextClassLoaderDispatch.dispatch(ContextClassLoaderDispatch.java:32)
	at org.gradle.internal.dispatch.ProxyDispatchAdapter$DispatchingInvocationHandler.invoke(ProxyDispatchAdapter.java:93)
	at com.sun.proxy.$Proxy2.processTestClass(Unknown Source)
	at org.gradle.api.internal.tasks.testing.worker.TestWorker.processTestClass(TestWorker.java:118)
	at sun.reflect.NativeMethodAccessorImpl.invoke0(Native Method)
	at sun.reflect.NativeMethodAccessorImpl.invoke(NativeMethodAccessorImpl.java:62)
	at sun.reflect.DelegatingMethodAccessorImpl.invoke(DelegatingMethodAccessorImpl.java:43)
	at java.lang.reflect.Method.invoke(Method.java:498)
	at org.gradle.internal.dispatch.ReflectionDispatch.dispatch(ReflectionDispatch.java:35)
	at org.gradle.internal.dispatch.ReflectionDispatch.dispatch(ReflectionDispatch.java:24)
	at org.gradle.internal.remote.internal.hub.MessageHubBackedObjectConnection$DispatchWrapper.dispatch(MessageHubBackedObjectConnection.java:175)
	at org.gradle.internal.remote.internal.hub.MessageHubBackedObjectConnection$DispatchWrapper.dispatch(MessageHubBackedObjectConnection.java:157)
	at org.gradle.internal.remote.internal.hub.MessageHub$Handler.run(MessageHub.java:404)
	at org.gradle.internal.concurrent.ExecutorPolicy$CatchAndRecordFailures.onExecute(ExecutorPolicy.java:63)
	at org.gradle.internal.concurrent.ManagedExecutorImpl$1.run(ManagedExecutorImpl.java:46)
	at java.util.concurrent.ThreadPoolExecutor.runWorker(ThreadPoolExecutor.java:1149)
	at java.util.concurrent.ThreadPoolExecutor$Worker.run(ThreadPoolExecutor.java:624)
	at org.gradle.internal.concurrent.ThreadFactoryImpl$ManagedThreadRunnable.run(ThreadFactoryImpl.java:55)
	at java.lang.Thread.run(Thread.java:748)