Build #653

Build: #653 failed

Job: Netty failed

Stages & jobs

  1. Default Stage

Job result summary

Completed
Duration
4 minutes
Agent
bamboo-2k16-02
Revision
871cc4c67e40078c6ec3e088252b3f15b1428d4c 871cc4c67e40078c6ec3e088252b3f15b1428d4c
Total tests
399
Failing since
#652 (Rebuilt by Violeta Georgieva)
Fixed in
#655 (Rebuilt by Violeta Georgieva)
No failed tests found, a possible compilation error occurred.

Tests

  • 399 tests in total
  • 23 tests were quarantined / skipped
  • 2 minutes taken in total.

Error summary

The build generated some errors. See the full build log for more details.

        at org.gradle.internal.execution.steps.CleanupOutputsStep.execute(CleanupOutputsStep.java:35)
        at org.gradle.internal.execution.steps.ResolveInputChangesStep.execute(ResolveInputChangesStep.java:48)
        at org.gradle.internal.execution.steps.ResolveInputChangesStep.execute(ResolveInputChangesStep.java:33)
        at org.gradle.internal.execution.steps.CancelExecutionStep.execute(CancelExecutionStep.java:39)
        at org.gradle.internal.execution.steps.TimeoutStep.executeWithoutTimeout(TimeoutStep.java:73)
        at org.gradle.internal.execution.steps.TimeoutStep.execute(TimeoutStep.java:54)
        at org.gradle.internal.execution.steps.CatchExceptionStep.execute(CatchExceptionStep.java:35)
        at org.gradle.internal.execution.steps.CreateOutputsStep.execute(CreateOutputsStep.java:51)
        at org.gradle.internal.execution.steps.SnapshotOutputsStep.execute(SnapshotOutputsStep.java:45)
        at org.gradle.internal.execution.steps.SnapshotOutputsStep.execute(SnapshotOutputsStep.java:31)
        at org.gradle.internal.execution.steps.CacheStep.executeWithoutCache(CacheStep.java:201)
        at org.gradle.internal.execution.steps.CacheStep.execute(CacheStep.java:70)
        at org.gradle.internal.execution.steps.CacheStep.execute(CacheStep.java:45)
        at org.gradle.internal.execution.steps.BroadcastChangingOutputsStep.execute(BroadcastChangingOutputsStep.java:49)
        at org.gradle.internal.execution.steps.StoreSnapshotsStep.execute(StoreSnapshotsStep.java:43)
        at org.gradle.internal.execution.steps.StoreSnapshotsStep.execute(StoreSnapshotsStep.java:32)
        at org.gradle.internal.execution.steps.RecordOutputsStep.execute(RecordOutputsStep.java:38)
        at org.gradle.internal.execution.steps.RecordOutputsStep.execute(RecordOutputsStep.java:24)
        at org.gradle.internal.execution.steps.SkipUpToDateStep.executeBecause(SkipUpToDateStep.java:96)
        at org.gradle.internal.execution.steps.SkipUpToDateStep.lambda$execute$0(SkipUpToDateStep.java:89)
        at org.gradle.internal.execution.steps.SkipUpToDateStep.execute(SkipUpToDateStep.java:54)
        at org.gradle.internal.execution.steps.SkipUpToDateStep.execute(SkipUpToDateStep.java:38)
        at org.gradle.internal.execution.steps.ResolveChangesStep.execute(ResolveChangesStep.java:77)
        at org.gradle.internal.execution.steps.ResolveChangesStep.execute(ResolveChangesStep.java:37)
        at org.gradle.internal.execution.steps.legacy.MarkSnapshottingInputsFinishedStep.execute(MarkSnapshottingInputsFinishedStep.java:36)
        at org.gradle.internal.execution.steps.legacy.MarkSnapshottingInputsFinishedStep.execute(MarkSnapshottingInputsFinishedStep.java:26)
        at org.gradle.internal.execution.steps.ResolveCachingStateStep.execute(ResolveCachingStateStep.java:90)
        at org.gradle.internal.execution.steps.ResolveCachingStateStep.execute(ResolveCachingStateStep.java:48)
        at org.gradle.internal.execution.impl.DefaultWorkExecutor.execute(DefaultWorkExecutor.java:33)
        at org.gradle.api.internal.tasks.execution.ExecuteActionsTaskExecuter.execute(ExecuteActionsTaskExecuter.java:120)
        ... 126 more
Caused by: org.gradle.api.UncheckedIOException: java.io.IOException: There is not enough space on the disk
        at org.gradle.api.internal.file.AbstractFileTreeElement.copyTo(AbstractFileTreeElement.java:63)
        at org.gradle.api.internal.file.copy.DefaultFileCopyDetails.copyTo(DefaultFileCopyDetails.java:103)
        at org.gradle.api.internal.file.archive.ZipCopyAction$StreamAction.visitFile(ZipCopyAction.java:123)
        ... 208 more
Caused by: java.io.IOException: There is not enough space on the disk
        at org.apache.tools.zip.ZipOutputStream.writeOut(ZipOutputStream.java:1528)
        at org.apache.tools.zip.ZipOutputStream.writeCounted(ZipOutputStream.java:933)
        at org.apache.tools.zip.ZipOutputStream.deflate(ZipOutputStream.java:1042)
        at org.apache.tools.zip.ZipOutputStream.deflateUntilInputIsNeeded(ZipOutputStream.java:1550)
        at org.apache.tools.zip.ZipOutputStream.writeDeflated(ZipOutputStream.java:950)
        at org.apache.tools.zip.ZipOutputStream.write(ZipOutputStream.java:915)
        at org.apache.commons.io.IOUtils.copyLarge(IOUtils.java:2315)
        at org.apache.commons.io.IOUtils.copy(IOUtils.java:2270)
        at org.apache.commons.io.IOUtils.copyLarge(IOUtils.java:2291)
        at org.gradle.api.internal.file.AbstractFileTreeElement.copyTo(AbstractFileTreeElement.java:58)
        ... 210 more


* Get more help at https://help.gradle.org

BUILD FAILED in 4m 28s

FAILURE: Build failed with an exception.

* What went wrong:
Could not add entry ':docsZip' to cache executionHistory.bin (C:\opt\bamboo-home\xml-data\build-dir\REACTOR-NETTYWIN-NETTY\.gradle\5.4\executionHistory\executionHistory.bin).
> java.io.IOException: There is not enough space on the disk

* Try:
Run with --debug option to get more log output. Run with --scan to get full insights.

* Exception is:
org.gradle.api.UncheckedIOException: Could not add entry ':docsZip' to cache executionHistory.bin (C:\opt\bamboo-home\xml-data\build-dir\REACTOR-NETTYWIN-NETTY\.gradle\5.4\executionHistory\executionHistory.bin).
        at org.gradle.cache.internal.btree.BTreePersistentIndexedCache.put(BTreePersistentIndexedCache.java:160)
        at org.gradle.cache.internal.DefaultMultiProcessSafePersistentIndexedCache$2.run(DefaultMultiProcessSafePersistentIndexedCache.java:72)
        at org.gradle.cache.internal.DefaultFileLockManager$DefaultFileLock.doWriteAction(DefaultFileLockManager.java:207)
        at org.gradle.cache.internal.DefaultFileLockManager$DefaultFileLock.writeFile(DefaultFileLockManager.java:197)
        at org.gradle.cache.internal.DefaultCacheAccess$UnitOfWorkFileAccess.writeFile(DefaultCacheAccess.java:412)
        at org.gradle.cache.internal.DefaultMultiProcessSafePersistentIndexedCache.put(DefaultMultiProcessSafePersistentIndexedCache.java:70)
        at org.gradle.cache.internal.AsyncCacheAccessDecoratedCache$2.run(AsyncCacheAccessDecoratedCache.java:64)
        at org.gradle.internal.concurrent.ExecutorPolicy$CatchAndRecordFailures.onExecute(ExecutorPolicy.java:63)
        at org.gradle.cache.internal.CacheAccessWorker$2.run(CacheAccessWorker.java:184)
        at org.gradle.internal.Factories$1.create(Factories.java:25)
        at org.gradle.cache.internal.DefaultCacheAccess.useCache(DefaultCacheAccess.java:223)
        at org.gradle.cache.internal.DefaultCacheAccess.useCache(DefaultCacheAccess.java:204)
        at org.gradle.cache.internal.CacheAccessWorker.flushOperations(CacheAccessWorker.java:174)
        at org.gradle.cache.internal.CacheAccessWorker.run(CacheAccessWorker.java:144)
        at org.gradle.internal.concurrent.ExecutorPolicy$CatchAndRecordFailures.onExecute(ExecutorPolicy.java:63)
        at org.gradle.internal.concurrent.ManagedExecutorImpl$1.run(ManagedExecutorImpl.java:46)
        at org.gradle.internal.concurrent.ThreadFactoryImpl$ManagedThreadRunnable.run(ThreadFactoryImpl.java:55)
Caused by: org.gradle.api.UncheckedIOException: java.io.IOException: There is not enough space on the disk
        at org.gradle.cache.internal.btree.FileBackedBlockStore.write(FileBackedBlockStore.java:118)
        at org.gradle.cache.internal.btree.CachingBlockStore.flush(CachingBlockStore.java:60)
        at org.gradle.cache.internal.btree.FreeListBlockStore.flush(FreeListBlockStore.java:92)
        at org.gradle.cache.internal.btree.StateCheckBlockStore.flush(StateCheckBlockStore.java:76)
        at org.gradle.cache.internal.btree.BTreePersistentIndexedCache.put(BTreePersistentIndexedCache.java:158)
        ... 16 more
Caused by: java.io.IOException: There is not enough space on the disk
        at org.gradle.internal.io.RandomAccessFileOutputStream.write(RandomAccessFileOutputStream.java:46)
        at org.gradle.cache.internal.btree.ByteOutput.done(ByteOutput.java:62)
        at org.gradle.cache.internal.btree.FileBackedBlockStore$BlockImpl.write(FileBackedBlockStore.java:200)
        at org.gradle.cache.internal.btree.FileBackedBlockStore.write(FileBackedBlockStore.java:114)
        ... 20 more


* Get more help at https://help.gradle.org

BUILD FAILED in 4m 28s