Build #658

Build: #658 failed

Job: Netty failed

Stages & jobs

  1. Default Stage

Job result summary

Completed
Duration
23 seconds
Agent
bamboo-2k16-02
Revision
87d792a5343d9da464ae7afa73a4abaf9bce7a2b 87d792a5343d9da464ae7afa73a4abaf9bce7a2b
Fixed in
#659 (Code changes detected)
No failed tests found, a possible compilation error occurred.

Error summary

The build generated some errors. See the full build log for more details.

Could not find test result reports in the C:\opt\bamboo-home\xml-data\build-dir\REACTOR-NETTYWIN-NETTY directory.
        at org.gradle.tooling.internal.provider.SessionScopeBuildActionExecuter.execute(SessionScopeBuildActionExecuter.java:38)
        at org.gradle.tooling.internal.provider.GradleThreadBuildActionExecuter.execute(GradleThreadBuildActionExecuter.java:37)
        at org.gradle.tooling.internal.provider.GradleThreadBuildActionExecuter.execute(GradleThreadBuildActionExecuter.java:26)
        at org.gradle.tooling.internal.provider.ParallelismConfigurationBuildActionExecuter.execute(ParallelismConfigurationBuildActionExecuter.java:43)
        at org.gradle.tooling.internal.provider.ParallelismConfigurationBuildActionExecuter.execute(ParallelismConfigurationBuildActionExecuter.java:29)
        at org.gradle.tooling.internal.provider.StartParamsValidatingActionExecuter.execute(StartParamsValidatingActionExecuter.java:60)
        at org.gradle.tooling.internal.provider.StartParamsValidatingActionExecuter.execute(StartParamsValidatingActionExecuter.java:32)
        at org.gradle.tooling.internal.provider.SessionFailureReportingActionExecuter.execute(SessionFailureReportingActionExecuter.java:55)
        at org.gradle.tooling.internal.provider.SessionFailureReportingActionExecuter.execute(SessionFailureReportingActionExecuter.java:41)
        at org.gradle.tooling.internal.provider.SetupLoggingActionExecuter.execute(SetupLoggingActionExecuter.java:48)
        at org.gradle.tooling.internal.provider.SetupLoggingActionExecuter.execute(SetupLoggingActionExecuter.java:32)
        at org.gradle.launcher.daemon.server.exec.ExecuteBuild.doBuild(ExecuteBuild.java:67)
        at org.gradle.launcher.daemon.server.exec.BuildCommandOnly.execute(BuildCommandOnly.java:36)
        at org.gradle.launcher.daemon.server.api.DaemonCommandExecution.proceed(DaemonCommandExecution.java:104)
        at org.gradle.launcher.daemon.server.exec.WatchForDisconnection.execute(WatchForDisconnection.java:37)
        at org.gradle.launcher.daemon.server.api.DaemonCommandExecution.proceed(DaemonCommandExecution.java:104)
        at org.gradle.launcher.daemon.server.exec.ResetDeprecationLogger.execute(ResetDeprecationLogger.java:26)
        at org.gradle.launcher.daemon.server.api.DaemonCommandExecution.proceed(DaemonCommandExecution.java:104)
        at org.gradle.launcher.daemon.server.exec.RequestStopIfSingleUsedDaemon.execute(RequestStopIfSingleUsedDaemon.java:34)
        at org.gradle.launcher.daemon.server.api.DaemonCommandExecution.proceed(DaemonCommandExecution.java:104)
        at org.gradle.launcher.daemon.server.exec.ForwardClientInput$2.call(ForwardClientInput.java:74)
        at org.gradle.launcher.daemon.server.exec.ForwardClientInput$2.call(ForwardClientInput.java:72)
        at org.gradle.util.Swapper.swap(Swapper.java:38)
        at org.gradle.launcher.daemon.server.exec.ForwardClientInput.execute(ForwardClientInput.java:72)
        at org.gradle.launcher.daemon.server.api.DaemonCommandExecution.proceed(DaemonCommandExecution.java:104)
        at org.gradle.launcher.daemon.server.exec.LogAndCheckHealth.execute(LogAndCheckHealth.java:50)
        at org.gradle.launcher.daemon.server.api.DaemonCommandExecution.proceed(DaemonCommandExecution.java:104)
        at org.gradle.launcher.daemon.server.exec.LogToClient.doBuild(LogToClient.java:62)
        at org.gradle.launcher.daemon.server.exec.BuildCommandOnly.execute(BuildCommandOnly.java:36)
        at org.gradle.launcher.daemon.server.api.DaemonCommandExecution.proceed(DaemonCommandExecution.java:104)
        at org.gradle.launcher.daemon.server.exec.EstablishBuildEnvironment.doBuild(EstablishBuildEnvironment.java:81)
        at org.gradle.launcher.daemon.server.exec.BuildCommandOnly.execute(BuildCommandOnly.java:36)
        at org.gradle.launcher.daemon.server.api.DaemonCommandExecution.proceed(DaemonCommandExecution.java:104)
        at org.gradle.launcher.daemon.server.exec.StartBuildOrRespondWithBusy$1.run(StartBuildOrRespondWithBusy.java:50)
        at org.gradle.launcher.daemon.server.DaemonStateCoordinator$1.run(DaemonStateCoordinator.java:295)
        at org.gradle.internal.concurrent.ExecutorPolicy$CatchAndRecordFailures.onExecute(ExecutorPolicy.java:63)
        at org.gradle.internal.concurrent.ManagedExecutorImpl$1.run(ManagedExecutorImpl.java:46)
        at org.gradle.internal.concurrent.ThreadFactoryImpl$ManagedThreadRunnable.run(ThreadFactoryImpl.java:55)
Caused by: org.gradle.api.artifacts.ResolveException: Could not resolve all dependencies for configuration ':compile'.
        at org.gradle.api.internal.artifacts.ivyservice.DefaultLenientConfiguration.getFailure(DefaultLenientConfiguration.java:143)
        at org.gradle.api.internal.artifacts.ivyservice.DefaultLenientConfiguration.rethrowFailure(DefaultLenientConfiguration.java:156)
        at org.gradle.api.internal.artifacts.ivyservice.DefaultResolvedConfiguration.rethrowFailure(DefaultResolvedConfiguration.java:43)
        at org.gradle.api.internal.artifacts.ivyservice.DefaultResolvedConfiguration.getResolvedArtifacts(DefaultResolvedConfiguration.java:76)
        at org.gradle.api.internal.artifacts.ivyservice.ErrorHandlingConfigurationResolver$ErrorHandlingResolvedConfiguration.getResolvedArtifacts(ErrorHandlingConfigurationResolver.java:303)
        at build_b896t8k76mdap9ajznc188qvg$_run_closure2$_closure19$_closure36$_closure37.doCall(C:\opt\bamboo-home\xml-data\build-dir\REACTOR-NETTYWIN-NETTY\build.gradle:323)
        at org.gradle.util.ClosureBackedAction.execute(ClosureBackedAction.java:70)
        at org.gradle.util.ConfigureUtil.configureTarget(ConfigureUtil.java:154)
        at org.gradle.util.ConfigureUtil.configure(ConfigureUtil.java:105)
        at org.gradle.util.ConfigureUtil$WrappedConfigureAction.execute(ConfigureUtil.java:166)
        at com.github.jengelman.gradle.plugins.shadow.tasks.ShadowJar.dependencies(ShadowJar.java:127)
        at com.github.jengelman.gradle.plugins.shadow.tasks.ShadowJar_Decorated.dependencies(Unknown Source)
        at build_b896t8k76mdap9ajznc188qvg$_run_closure2$_closure19$_closure36.doCall(C:\opt\bamboo-home\xml-data\build-dir\REACTOR-NETTYWIN-NETTY\build.gradle:315)
        at org.gradle.configuration.internal.DefaultListenerBuildOperationDecorator$BuildOperationEmittingClosure$1$1.run(DefaultListenerBuildOperationDecorator.java:181)
        at org.gradle.configuration.internal.DefaultUserCodeApplicationContext.reapply(DefaultUserCodeApplicationContext.java:58)
        at org.gradle.configuration.internal.DefaultListenerBuildOperationDecorator$BuildOperationEmittingClosure$1.run(DefaultListenerBuildOperationDecorator.java:176)
        at org.gradle.internal.operations.DefaultBuildOperationExecutor$RunnableBuildOperationWorker.execute(DefaultBuildOperationExecutor.java:402)
        at org.gradle.internal.operations.DefaultBuildOperationExecutor$RunnableBuildOperationWorker.execute(DefaultBuildOperationExecutor.java:394)
        at org.gradle.internal.operations.DefaultBuildOperationExecutor$1.execute(DefaultBuildOperationExecutor.java:165)
        at org.gradle.internal.operations.DefaultBuildOperationExecutor.execute(DefaultBuildOperationExecutor.java:250)
        at org.gradle.internal.operations.DefaultBuildOperationExecutor.execute(DefaultBuildOperationExecutor.java:158)
        at org.gradle.internal.operations.DefaultBuildOperationExecutor.run(DefaultBuildOperationExecutor.java:92)
        at org.gradle.configuration.internal.DefaultListenerBuildOperationDecorator$BuildOperationEmittingClosure.doCall(DefaultListenerBuildOperationDecorator.java:173)
        at org.gradle.listener.ClosureBackedMethodInvocationDispatch.dispatch(ClosureBackedMethodInvocationDispatch.java:40)
        at org.gradle.listener.ClosureBackedMethodInvocationDispatch.dispatch(ClosureBackedMethodInvocationDispatch.java:25)
        at org.gradle.internal.event.AbstractBroadcastDispatch.dispatch(AbstractBroadcastDispatch.java:42)
        at org.gradle.internal.event.BroadcastDispatch$SingletonDispatch.dispatch(BroadcastDispatch.java:230)
        at org.gradle.internal.event.BroadcastDispatch$SingletonDispatch.dispatch(BroadcastDispatch.java:149)
        at org.gradle.internal.event.AbstractBroadcastDispatch.dispatch(AbstractBroadcastDispatch.java:58)
        at org.gradle.internal.event.BroadcastDispatch$CompositeDispatch.dispatch(BroadcastDispatch.java:324)
        at org.gradle.internal.event.BroadcastDispatch$CompositeDispatch.dispatch(BroadcastDispatch.java:234)
        at org.gradle.internal.event.ListenerBroadcast.dispatch(ListenerBroadcast.java:140)
        at org.gradle.internal.event.ListenerBroadcast.dispatch(ListenerBroadcast.java:37)
        at org.gradle.internal.dispatch.ProxyDispatchAdapter$DispatchingInvocationHandler.invoke(ProxyDispatchAdapter.java:93)
        at com.sun.proxy.$Proxy32.afterEvaluate(Unknown Source)
        at org.gradle.configuration.project.LifecycleProjectEvaluator$NotifyAfterEvaluate$1.execute(LifecycleProjectEvaluator.java:190)
        at org.gradle.configuration.project.LifecycleProjectEvaluator$NotifyAfterEvaluate$1.execute(LifecycleProjectEvaluator.java:187)
        at org.gradle.api.internal.project.DefaultProject.stepEvaluationListener(DefaultProject.java:1424)
        at org.gradle.configuration.project.LifecycleProjectEvaluator$NotifyAfterEvaluate.run(LifecycleProjectEvaluator.java:196)
        ... 112 more
Caused by: org.gradle.internal.resolve.ModuleVersionNotFoundException: Could not find io.projectreactor.addons:reactor-pool:0.1.0.RC1.
Searched in the following locations:
  - https://repo.maven.apache.org/maven2/io/projectreactor/addons/reactor-pool/0.1.0.RC1/reactor-pool-0.1.0.RC1.pom
  - https://repo.maven.apache.org/maven2/io/projectreactor/addons/reactor-pool/0.1.0.RC1/reactor-pool-0.1.0.RC1.jar
  - https://repo.spring.io/libs-snapshot/io/projectreactor/addons/reactor-pool/0.1.0.RC1/reactor-pool-0.1.0.RC1.pom
  - https://repo.spring.io/libs-snapshot/io/projectreactor/addons/reactor-pool/0.1.0.RC1/reactor-pool-0.1.0.RC1.jar
  - https://repo.spring.io/libs-milestone/io/projectreactor/addons/reactor-pool/0.1.0.RC1/reactor-pool-0.1.0.RC1.pom
  - https://repo.spring.io/libs-milestone/io/projectreactor/addons/reactor-pool/0.1.0.RC1/reactor-pool-0.1.0.RC1.jar
  - https://repo.spring.io/libs-release/io/projectreactor/addons/reactor-pool/0.1.0.RC1/reactor-pool-0.1.0.RC1.pom
  - https://repo.spring.io/libs-release/io/projectreactor/addons/reactor-pool/0.1.0.RC1/reactor-pool-0.1.0.RC1.jar
  - https://oss.sonatype.org/content/repositories/releases/io/projectreactor/addons/reactor-pool/0.1.0.RC1/reactor-pool-0.1.0.RC1.pom
  - https://oss.sonatype.org/content/repositories/releases/io/projectreactor/addons/reactor-pool/0.1.0.RC1/reactor-pool-0.1.0.RC1.jar
  - https://jcenter.bintray.com/io/projectreactor/addons/reactor-pool/0.1.0.RC1/reactor-pool-0.1.0.RC1.pom
  - https://jcenter.bintray.com/io/projectreactor/addons/reactor-pool/0.1.0.RC1/reactor-pool-0.1.0.RC1.jar
Required by:
    project :


* Get more help at https://help.gradle.org

BUILD FAILED in 22s