Build #722

Build: #722 failed

Job: Netty failed

Stages & jobs

  1. Default Stage

Test results

  • 412 tests in total
  • 1 test failed
  • 1 failure is new
  • 25 tests were quarantined / skipped
  • 2 minutes taken in total.

Build 722 has the following 1 errors: 1 new failure(s) occurred since the previous build.

New test failures 1
Status Test Duration
Collapse Failed HttpsMetricsHandlerTests testExistingEndpoint History
10 secs
java.lang.AssertionError: java.lang.AssertionError
java.lang.AssertionError
	at org.junit.Assert.fail(Assert.java:86)
	at org.junit.Assert.assertTrue(Assert.java:41)
	at org.junit.Assert.assertTrue(Assert.java:52)
	at reactor.netty.http.HttpMetricsHandlerTests.checkTimer(HttpMetricsHandlerTests.java:291)
	at reactor.netty.http.HttpsMetricsHandlerTests.checkTlsTimer(HttpsMetricsHandlerTests.java:70)
	at reactor.netty.http.HttpMetricsHandlerTests.checkExpectationsExisting(HttpMetricsHandlerTests.java:206)
(49 more lines...)