Build #723

Build: #723 failed

Job: Netty failed

Stages & jobs

  1. Default Stage

Test results

  • 413 tests in total
  • 1 test failed
  • 1 failure is new
  • 1 test was fixed
  • 25 tests were quarantined / skipped
  • 2 minutes taken in total.

Build 723 has the following 1 errors: 1 new failure(s) occurred since the previous build.

New test failures 1
Status Test Duration
Collapse Failed TcpSecureMetricsTests testSuccessfulCommunication History
< 1 sec
java.lang.AssertionError: java.lang.AssertionError
java.lang.AssertionError
	at org.junit.Assert.fail(Assert.java:86)
	at org.junit.Assert.assertTrue(Assert.java:41)
	at org.junit.Assert.assertTrue(Assert.java:52)
	at reactor.netty.tcp.TcpMetricsTests.checkTimer(TcpMetricsTests.java:204)
	at reactor.netty.tcp.TcpSecureMetricsTests.checkTlsTimer(TcpSecureMetricsTests.java:78)
	at reactor.netty.tcp.TcpMetricsTests.checkExpectationsPositive(TcpMetricsTests.java:157)
(49 more lines...)