Build #458

Build: #458 failed Changes by Violeta Georgieva

Build result summary

Details

Completed
Duration
2 minutes
Labels
None
Agent
bamboo-2k16-00
Revision
eafc0950af58ec19238fd23c7f26927b9d48dbf2 eafc0950af58ec19238fd23c7f26927b9d48dbf2
Total tests
351
Failing since
#447 (Changes by Violeta Georgieva)

Responsible

Code commits

Author Commit Message Commit date
Violeta Georgieva Violeta Georgieva eafc0950af58ec19238fd23c7f26927b9d48dbf2 eafc0950af58ec19238fd23c7f26927b9d48dbf2 Remove unused property

Tests

New test failures 1
Status Test View job Duration
Collapse Failed HttpsSendFileTests sendFileAsync4096Negative History
Netty 4 secs
org.junit.ComparisonFailure: org.junit.ComparisonFailure: expected:<[101, 114, 114, 111, 114]> but was:<null>
org.junit.ComparisonFailure: expected:<[101, 114, 114, 111, 114]> but was:<null>
	at sun.reflect.NativeConstructorAccessorImpl.newInstance0(Native Method)
	at sun.reflect.NativeConstructorAccessorImpl.newInstance(NativeConstructorAccessorImpl.java:62)
	at sun.reflect.DelegatingConstructorAccessorImpl.newInstance(DelegatingConstructorAccessorImpl.java:45)
	at reactor.netty.http.server.HttpSendFileTests.doTestSendFileAsync(HttpSendFileTests.java:350)
	at reactor.netty.http.server.HttpSendFileTests.sendFileAsync4096Negative(HttpSendFileTests.java:290)
	at sun.reflect.NativeMethodAccessorImpl.invoke0(Native Method)
(45 more lines...)
Existing test failures 2
Status Test Failing since View job Duration
java.lang.AssertionError: java.lang.AssertionError
java.lang.AssertionError
	at org.junit.Assert.fail(Assert.java:86)
	at org.junit.Assert.assertTrue(Assert.java:41)
	at org.junit.Assert.assertTrue(Assert.java:52)
	at reactor.netty.ByteBufFluxTest.deleteTemporaryDirectoryRecursively(ByteBufFluxTest.java:113)
	at reactor.netty.ByteBufFluxTest.deleteTempDir(ByteBufFluxTest.java:58)
	at sun.reflect.NativeMethodAccessorImpl.invoke0(Native Method)
(38 more lines...)
java.lang.AssertionError: java.lang.AssertionError
java.lang.AssertionError
	at org.junit.Assert.fail(Assert.java:86)
	at org.junit.Assert.assertTrue(Assert.java:41)
	at org.junit.Assert.assertTrue(Assert.java:52)
	at reactor.netty.udp.UdpServerTests.supportsUdpMulticast(UdpServerTests.java:205)
	at sun.reflect.NativeMethodAccessorImpl.invoke0(Native Method)
	at sun.reflect.NativeMethodAccessorImpl.invoke(NativeMethodAccessorImpl.java:62)
(45 more lines...)