Build #2,995

Next Gen Reactor Addons

Build result summary

Details

Completed
Duration
16 minutes
Labels
None
Agent
bamboo-09.af.pivotal.io
Revision
5ac5ecc3888fc705eb05ba3415b73003e06ee650 5ac5ecc3888fc705eb05ba3415b73003e06ee650
Total tests
266
Fixed in
#2996 (Manual run by Stephane Maldini)

Responsible

No one has taken responsibility for this failure

Code commits

Author Commit Message Commit date
Stephane Maldini <smaldini@pivotal.io> Stephane Maldini <smaldini@pivotal.io> 5ac5ecc3888fc705eb05ba3415b73003e06ee650 5ac5ecc3888fc705eb05ba3415b73003e06ee650 Prepare 3.2.0.RC1

Tests

New test failures 2
Status Test View job Duration
Collapse Failed RetryTests fluxRetryExponentialBackoff History
Reactor Extensions 1 sec
java.lang.AssertionError: java.lang.AssertionError: expectation failed (expected no event: onNext(0))
java.lang.AssertionError: expectation failed (expected no event: onNext(0))
	at reactor.test.ErrorFormatter.assertionError(ErrorFormatter.java:105)
	at reactor.test.ErrorFormatter.failPrefix(ErrorFormatter.java:94)
	at reactor.test.ErrorFormatter.fail(ErrorFormatter.java:64)
	at reactor.test.DefaultStepVerifierBuilder$DefaultVerifySubscriber.setFailure(DefaultStepVerifierBuilder.java:1204)
	at reactor.test.DefaultStepVerifierBuilder$DefaultVerifySubscriber.onExpectation(DefaultStepVerifierBuilder.java:1296)
	at reactor.test.DefaultStepVerifierBuilder$DefaultVerifySubscriber.onNext(DefaultStepVerifierBuilder.java:1028)
(25 more lines...)
Collapse Failed ForkJoinPoolSchedulerTest smokeTestDelay History
Reactor Extensions 1 sec
java.lang.AssertionError: java.lang.AssertionError: [iteration 3, measured delay 724847162 nanos, start at 539865668886510 nanos, end at 539866393733672 nanos] 
Expecting:
 <724L>
to be less than:
 <200L> 
java.lang.AssertionError: [iteration 3, measured delay 724847162 nanos, start at 539865668886510 nanos, end at 539866393733672 nanos] 
Expecting:
 <724L>
(49 more lines...)