Build #18

Next Gen Reactor Addons

Build: #18 failed Changes by Simon Baslé <sbasle@vmware.com>

Build result summary

Details

Completed
Duration
1 minute
Labels
None
Agent
bamboo-15.af.pivotal.io
Revision
4f5cc38322d49aa8a20e0ec66ebcfcede9f32ac3 4f5cc38322d49aa8a20e0ec66ebcfcede9f32ac3
Total tests
374
Fixed in
#19 (Changes by Simon Baslé <sbasle@vmware.com>)
No failed test found. A possible compilation error occurred.

Tests

Responsible

No one has taken responsibility for this failure

Code commits

Author Commit Message Commit date
Simon Baslé <sbasle@vmware.com> Simon Baslé <sbasle@vmware.com> 4f5cc38322d49aa8a20e0ec66ebcfcede9f32ac3 4f5cc38322d49aa8a20e0ec66ebcfcede9f32ac3 Release 3.3.5.RELEASE via gha
Simon Baslé <sbasle@vmware.com> Simon Baslé <sbasle@vmware.com> 5943f1e875876a1e28843808df7c2e83688cd5b7 5943f1e875876a1e28843808df7c2e83688cd5b7 Prepare release 3.3.5.RELEASE

Error summary for Reactor Extensions

The job generated some errors, drill down into the full build log for more details.

        at org.gradle.internal.operations.DefaultBuildOperationExecutor$1.execute(DefaultBuildOperationExecutor.java:165)
        at org.gradle.internal.operations.DefaultBuildOperationExecutor.execute(DefaultBuildOperationExecutor.java:250)
        at org.gradle.internal.operations.DefaultBuildOperationExecutor.execute(DefaultBuildOperationExecutor.java:158)
        at org.gradle.internal.operations.DefaultBuildOperationExecutor.call(DefaultBuildOperationExecutor.java:102)
        at org.gradle.internal.operations.DelegatingBuildOperationExecutor.call(DelegatingBuildOperationExecutor.java:36)
        at org.gradle.api.internal.tasks.execution.EventFiringTaskExecuter.execute(EventFiringTaskExecuter.java:52)
        at org.gradle.execution.plan.LocalTaskNodeExecutor.execute(LocalTaskNodeExecutor.java:43)
        at org.gradle.execution.taskgraph.DefaultTaskExecutionGraph$InvokeNodeExecutorsAction.execute(DefaultTaskExecutionGraph.java:355)
        at org.gradle.execution.taskgraph.DefaultTaskExecutionGraph$InvokeNodeExecutorsAction.execute(DefaultTaskExecutionGraph.java:343)
        at org.gradle.execution.taskgraph.DefaultTaskExecutionGraph$BuildOperationAwareExecutionAction.execute(DefaultTaskExecutionGraph.java:336)
        at org.gradle.execution.taskgraph.DefaultTaskExecutionGraph$BuildOperationAwareExecutionAction.execute(DefaultTaskExecutionGraph.java:322)
        at org.gradle.execution.plan.DefaultPlanExecutor$ExecutorWorker$1.execute(DefaultPlanExecutor.java:134)
        at org.gradle.execution.plan.DefaultPlanExecutor$ExecutorWorker$1.execute(DefaultPlanExecutor.java:129)
        at org.gradle.execution.plan.DefaultPlanExecutor$ExecutorWorker.execute(DefaultPlanExecutor.java:202)
        at org.gradle.execution.plan.DefaultPlanExecutor$ExecutorWorker.executeNextNode(DefaultPlanExecutor.java:193)
        at org.gradle.execution.plan.DefaultPlanExecutor$ExecutorWorker.run(DefaultPlanExecutor.java:129)
        at org.gradle.internal.concurrent.ExecutorPolicy$CatchAndRecordFailures.onExecute(ExecutorPolicy.java:64)
        at org.gradle.internal.concurrent.ManagedExecutorImpl$1.run(ManagedExecutorImpl.java:48)
        at org.gradle.internal.concurrent.ThreadFactoryImpl$ManagedThreadRunnable.run(ThreadFactoryImpl.java:56)
Caused by: java.lang.RuntimeException: java.util.concurrent.ExecutionException: java.lang.RuntimeException: java.io.IOException: Failed to deploy file. Status code: 409 Response message: Artifactory returned the following errors:
The repository 'libs-snapshot-local' rejected the resolution of an artifact 'libs-snapshot-local:io/projectreactor/addons/reactor-adapter/3.3.5.RELEASE/reactor-adapter-3.3.5.RELEASE-javadoc.jar' due to conflict in the snapshot release handling policy. Status code: 409
        at org.jfrog.gradle.plugin.artifactory.task.DeployTask.prepareAndDeploy(DeployTask.java:97)
        at org.jfrog.gradle.plugin.artifactory.task.DeployTask.collectProjectBuildInfo(DeployTask.java:55)
        at org.jfrog.gradle.plugin.artifactory.task.DeployTask.taskAction(DeployTask.java:49)
        at org.gradle.internal.reflect.JavaMethod.invoke(JavaMethod.java:103)
        at org.gradle.api.internal.project.taskfactory.StandardTaskAction.doExecute(StandardTaskAction.java:49)
        at org.gradle.api.internal.project.taskfactory.StandardTaskAction.execute(StandardTaskAction.java:42)
        at org.gradle.api.internal.project.taskfactory.StandardTaskAction.execute(StandardTaskAction.java:28)
        at org.gradle.api.internal.AbstractTask$TaskActionWrapper.execute(AbstractTask.java:717)
        at org.gradle.api.internal.AbstractTask$TaskActionWrapper.execute(AbstractTask.java:684)
        at org.gradle.api.internal.tasks.execution.ExecuteActionsTaskExecuter$5.run(ExecuteActionsTaskExecuter.java:476)
        at org.gradle.internal.operations.DefaultBuildOperationExecutor$RunnableBuildOperationWorker.execute(DefaultBuildOperationExecutor.java:402)
        at org.gradle.internal.operations.DefaultBuildOperationExecutor$RunnableBuildOperationWorker.execute(DefaultBuildOperationExecutor.java:394)
        at org.gradle.internal.operations.DefaultBuildOperationExecutor$1.execute(DefaultBuildOperationExecutor.java:165)
        at org.gradle.internal.operations.DefaultBuildOperationExecutor.execute(DefaultBuildOperationExecutor.java:250)
        at org.gradle.internal.operations.DefaultBuildOperationExecutor.execute(DefaultBuildOperationExecutor.java:158)
        at org.gradle.internal.operations.DefaultBuildOperationExecutor.run(DefaultBuildOperationExecutor.java:92)
        at org.gradle.internal.operations.DelegatingBuildOperationExecutor.run(DelegatingBuildOperationExecutor.java:31)
        at org.gradle.api.internal.tasks.execution.ExecuteActionsTaskExecuter.executeAction(ExecuteActionsTaskExecuter.java:461)
        at org.gradle.api.internal.tasks.execution.ExecuteActionsTaskExecuter.executeActions(ExecuteActionsTaskExecuter.java:444)
        at org.gradle.api.internal.tasks.execution.ExecuteActionsTaskExecuter.access$200(ExecuteActionsTaskExecuter.java:93)
        at org.gradle.api.internal.tasks.execution.ExecuteActionsTaskExecuter$TaskExecution.execute(ExecuteActionsTaskExecuter.java:237)
        at org.gradle.internal.execution.steps.ExecuteStep.lambda$execute$1(ExecuteStep.java:33)
        at org.gradle.internal.execution.steps.ExecuteStep.execute(ExecuteStep.java:33)
        at org.gradle.internal.execution.steps.ExecuteStep.execute(ExecuteStep.java:26)
        at org.gradle.internal.execution.steps.CleanupOutputsStep.execute(CleanupOutputsStep.java:58)
        at org.gradle.internal.execution.steps.CleanupOutputsStep.execute(CleanupOutputsStep.java:35)
        at org.gradle.internal.execution.steps.ResolveInputChangesStep.execute(ResolveInputChangesStep.java:48)
        at org.gradle.internal.execution.steps.ResolveInputChangesStep.execute(ResolveInputChangesStep.java:33)
        at org.gradle.internal.execution.steps.CancelExecutionStep.execute(CancelExecutionStep.java:39)
        at org.gradle.internal.execution.steps.TimeoutStep.executeWithoutTimeout(TimeoutStep.java:73)
        at org.gradle.internal.execution.steps.TimeoutStep.execute(TimeoutStep.java:54)
        at org.gradle.internal.execution.steps.CatchExceptionStep.execute(CatchExceptionStep.java:35)
        at org.gradle.internal.execution.steps.CreateOutputsStep.execute(CreateOutputsStep.java:51)
        at org.gradle.internal.execution.steps.SnapshotOutputsStep.execute(SnapshotOutputsStep.java:45)
        at org.gradle.internal.execution.steps.SnapshotOutputsStep.execute(SnapshotOutputsStep.java:31)
        at org.gradle.internal.execution.steps.CacheStep.executeWithoutCache(CacheStep.java:208)
        at org.gradle.internal.execution.steps.CacheStep.execute(CacheStep.java:70)
        at org.gradle.internal.execution.steps.CacheStep.execute(CacheStep.java:45)
        at org.gradle.internal.execution.steps.BroadcastChangingOutputsStep.execute(BroadcastChangingOutputsStep.java:49)
        at org.gradle.internal.execution.steps.StoreSnapshotsStep.execute(StoreSnapshotsStep.java:43)
        at org.gradle.internal.execution.steps.StoreSnapshotsStep.execute(StoreSnapshotsStep.java:32)
        at org.gradle.internal.execution.steps.RecordOutputsStep.execute(RecordOutputsStep.java:38)
        at org.gradle.internal.execution.steps.RecordOutputsStep.execute(RecordOutputsStep.java:24)
        at org.gradle.internal.execution.steps.SkipUpToDateStep.executeBecause(SkipUpToDateStep.java:96)
        at org.gradle.internal.execution.steps.SkipUpToDateStep.lambda$execute$0(SkipUpToDateStep.java:89)
        at org.gradle.internal.execution.steps.SkipUpToDateStep.execute(SkipUpToDateStep.java:54)
        at org.gradle.internal.execution.steps.SkipUpToDateStep.execute(SkipUpToDateStep.java:38)
        at org.gradle.internal.execution.steps.ResolveChangesStep.execute(ResolveChangesStep.java:76)
        at org.gradle.internal.execution.steps.ResolveChangesStep.execute(ResolveChangesStep.java:37)
        at org.gradle.internal.execution.steps.legacy.MarkSnapshottingInputsFinishedStep.execute(MarkSnapshottingInputsFinishedStep.java:36)
        at org.gradle.internal.execution.steps.legacy.MarkSnapshottingInputsFinishedStep.execute(MarkSnapshottingInputsFinishedStep.java:26)
        at org.gradle.internal.execution.steps.ResolveCachingStateStep.execute(ResolveCachingStateStep.java:90)
        at org.gradle.internal.execution.steps.ResolveCachingStateStep.execute(ResolveCachingStateStep.java:48)
        at org.gradle.internal.execution.steps.CaptureStateBeforeExecutionStep.execute(CaptureStateBeforeExecutionStep.java:69)
        at org.gradle.internal.execution.steps.CaptureStateBeforeExecutionStep.execute(CaptureStateBeforeExecutionStep.java:47)
        at org.gradle.internal.execution.impl.DefaultWorkExecutor.execute(DefaultWorkExecutor.java:33)
        at org.gradle.api.internal.tasks.execution.ExecuteActionsTaskExecuter.execute(ExecuteActionsTaskExecuter.java:140)
        ... 34 more
Caused by: java.util.concurrent.ExecutionException: java.lang.RuntimeException: java.io.IOException: Failed to deploy file. Status code: 409 Response message: Artifactory returned the following errors:
The repository 'libs-snapshot-local' rejected the resolution of an artifact 'libs-snapshot-local:io/projectreactor/addons/reactor-adapter/3.3.5.RELEASE/reactor-adapter-3.3.5.RELEASE-javadoc.jar' due to conflict in the snapshot release handling policy. Status code: 409
        at org.jfrog.gradle.plugin.artifactory.task.DeployTask.prepareAndDeploy(DeployTask.java:95)
        ... 90 more
Caused by: java.lang.RuntimeException: java.io.IOException: Failed to deploy file. Status code: 409 Response message: Artifactory returned the following errors:
The repository 'libs-snapshot-local' rejected the resolution of an artifact 'libs-snapshot-local:io/projectreactor/addons/reactor-adapter/3.3.5.RELEASE/reactor-adapter-3.3.5.RELEASE-javadoc.jar' due to conflict in the snapshot release handling policy. Status code: 409
        at org.jfrog.gradle.plugin.artifactory.task.DeployTask.deployArtifacts(DeployTask.java:205)
        at org.jfrog.gradle.plugin.artifactory.task.DeployTask.lambda$null$1(DeployTask.java:93)
Caused by: java.io.IOException: Failed to deploy file. Status code: 409 Response message: Artifactory returned the following errors:
The repository 'libs-snapshot-local' rejected the resolution of an artifact 'libs-snapshot-local:io/projectreactor/addons/reactor-adapter/3.3.5.RELEASE/reactor-adapter-3.3.5.RELEASE-javadoc.jar' due to conflict in the snapshot release handling policy. Status code: 409
        at org.jfrog.build.extractor.clientConfiguration.client.ArtifactoryBuildInfoClient.uploadFile(ArtifactoryBuildInfoClient.java:697)
        at org.jfrog.build.extractor.clientConfiguration.client.ArtifactoryBuildInfoClient.doDeployArtifact(ArtifactoryBuildInfoClient.java:379)
        at org.jfrog.build.extractor.clientConfiguration.client.ArtifactoryBuildInfoClient.deployArtifact(ArtifactoryBuildInfoClient.java:367)
        at org.jfrog.gradle.plugin.artifactory.task.DeployTask.deployArtifacts(DeployTask.java:286)
        at org.jfrog.gradle.plugin.artifactory.task.DeployTask.deployArtifacts(DeployTask.java:185)
        ... 1 more


* Get more help at https://help.gradle.org

BUILD FAILED in 1m 4s