Logs

The following logs have been generated by the jobs in this plan.
  • Expand all
  • Collapse all
Job Logs
Collapse Aeron Default Stage Download or View
22-Oct-2017 15:52:08         at org.gradle.internal.concurrent.StoppableExecutorImpl$1.run(StoppableExecutorImpl.java:46)
22-Oct-2017 15:52:08 Caused by: org.gradle.api.GradleException: There were failing tests. See the report at: file:///opt/bamboo-home/xml-data/build-dir/REACTOR-RAERON-AERON/build/reports/tests/test/index.html
22-Oct-2017 15:52:08         at org.gradle.api.tasks.testing.Test.handleTestFailures(Test.java:1304)
22-Oct-2017 15:52:08         at org.gradle.api.tasks.testing.Test.executeTests(Test.java:671)
22-Oct-2017 15:52:08         at org.gradle.internal.reflect.JavaMethod.invoke(JavaMethod.java:73)
22-Oct-2017 15:52:08         at org.gradle.api.internal.project.taskfactory.DefaultTaskClassInfoStore$StandardTaskAction.doExecute(DefaultTaskClassInfoStore.java:141)
22-Oct-2017 15:52:08         at org.gradle.api.internal.project.taskfactory.DefaultTaskClassInfoStore$StandardTaskAction.execute(DefaultTaskClassInfoStore.java:134)
22-Oct-2017 15:52:08         at org.gradle.api.internal.project.taskfactory.DefaultTaskClassInfoStore$StandardTaskAction.execute(DefaultTaskClassInfoStore.java:123)
22-Oct-2017 15:52:08         at org.gradle.api.internal.AbstractTask$TaskActionWrapper.execute(AbstractTask.java:692)
22-Oct-2017 15:52:08         at org.gradle.api.internal.AbstractTask$TaskActionWrapper.execute(AbstractTask.java:675)
22-Oct-2017 15:52:08         at org.gradle.api.internal.tasks.execution.ExecuteActionsTaskExecuter$1.execute(ExecuteActionsTaskExecuter.java:115)
22-Oct-2017 15:52:08         at org.gradle.api.internal.tasks.execution.ExecuteActionsTaskExecuter$1.execute(ExecuteActionsTaskExecuter.java:109)
22-Oct-2017 15:52:08         at org.gradle.internal.Transformers$4.transform(Transformers.java:169)
22-Oct-2017 15:52:08         at org.gradle.internal.progress.DefaultBuildOperationExecutor.run(DefaultBuildOperationExecutor.java:106)
22-Oct-2017 15:52:08         at org.gradle.internal.progress.DefaultBuildOperationExecutor.run(DefaultBuildOperationExecutor.java:56)
22-Oct-2017 15:52:08         at org.gradle.api.internal.tasks.execution.ExecuteActionsTaskExecuter.executeAction(ExecuteActionsTaskExecuter.java:109)
22-Oct-2017 15:52:08         at org.gradle.api.internal.tasks.execution.ExecuteActionsTaskExecuter.executeActions(ExecuteActionsTaskExecuter.java:90)
22-Oct-2017 15:52:08         ... 70 more
22-Oct-2017 15:52:08
22-Oct-2017 15:52:08
22-Oct-2017 15:52:08 BUILD FAILED
22-Oct-2017 15:52:08
22-Oct-2017 15:52:08 Total time: 31.765 secs
22-Oct-2017 15:52:08 Stopped 0 worker daemon(s).
22-Oct-2017 15:52:08 Received result Failure[value=org.gradle.initialization.ReportedException: org.gradle.internal.exceptions.LocationAwareException: Execution failed for task ':test'.] from daemon DaemonInfo{pid=20149, address=[4e37b6bf-edd1-449a-ae2c-7a5eb37bcf9a port:46204, addresses:[/0:0:0:0:0:0:0:1, /127.0.0.1]], state=Busy, lastBusy=1508687499314, context=DefaultDaemonContext[uid=7137994e-5708-43f8-9e5b-24761726af17,javaHome=/opt/jdk1.8.0_144,daemonRegistryDir=/opt/users/bamboo/.gradle/daemon,pid=20149,idleTimeout=10800000,daemonOpts=-XX:MaxPermSize=256m,-XX:+HeapDumpOnOutOfMemoryError,-Xmx1024m,-Dfile.encoding=UTF-8,-Duser.country=US,-Duser.language=en,-Duser.variant]} (build should be done).