Build: #630 failed

Job: Aeron failed

Stages & jobs

  1. Default Stage

Build log

The build generated 561 lines of output. Download or view full build log

22-Oct-2017 15:51:35 Build Project Reactor - Reactor Aeron - Aeron #630 (REACTOR-RAERON-AERON-630) started building on agent bamboo-07.af.pivotal.io
22-Oct-2017 15:51:35 Remote agent on host bamboo-07.af.pivotal.io
22-Oct-2017 15:51:35 Build working directory is /opt/bamboo-home/xml-data/build-dir/REACTOR-RAERON-AERON
22-Oct-2017 15:51:35 Executing build Project Reactor - Reactor Aeron - Aeron #630 (REACTOR-RAERON-AERON-630)
22-Oct-2017 15:51:35 Starting task 'Checkout' of type 'com.atlassian.bamboo.plugins.vcs:task.vcs.checkout'
22-Oct-2017 15:51:35 Build always requires a clean checkout
22-Oct-2017 15:51:35 Cleaning build directory '/opt/bamboo-home/xml-data/build-dir/REACTOR-RAERON-AERON'
22-Oct-2017 15:51:35 Updating source code to revision: cbfb4b43e04c18f5d63fe036ff1b31f56d5626eb
22-Oct-2017 15:51:35 Creating local git repository in '/opt/bamboo-home/xml-data/build-dir/REACTOR-RAERON-AERON/.git'.
22-Oct-2017 15:51:35 Initialized empty Git repository in /opt/bamboo-home/xml-data/build-dir/REACTOR-RAERON-AERON/.git/
22-Oct-2017 15:51:35 Fetching 'refs/heads/master' from 'https://github.com/reactor/reactor-aeron.git'. Will try to do a shallow fetch.
22-Oct-2017 15:51:36 From https://github.com/reactor/reactor-aeron
22-Oct-2017 15:51:36 * [new branch]      master     -> master
22-Oct-2017 15:51:36 Checking out revision cbfb4b43e04c18f5d63fe036ff1b31f56d5626eb.
22-Oct-2017 15:51:36 Already on 'master'
22-Oct-2017 15:51:36 Updated source code to revision: cbfb4b43e04c18f5d63fe036ff1b31f56d5626eb
22-Oct-2017 15:51:36 Finished task 'Checkout' with result: Success
22-Oct-2017 15:51:36 Running pre-build action: Artifactory Release Staging
22-Oct-2017 15:51:36 Running pre-build action: VCS Version Collector
22-Oct-2017 15:51:36 Running pre-build action: Hung Build Killer PreBuildAction
22-Oct-2017 15:51:36 Starting task 'Build Test Assemble' of type 'org.jfrog.bamboo.bamboo-artifactory-plugin:artifactoryGradleTask'
22-Oct-2017 15:51:36 Bamboo Artifactory Plugin version: 2.1.0
22-Oct-2017 15:51:36
Beginning to execute external process for build 'Project Reactor - Reactor Aeron - Aeron #630 (REACTOR-RAERON-AERON-630)'
... running command line:
./gradlew --stacktrace --info clean test assemble -I /tmp/artifactory.init.script5470759177918777128gradle -DbuildInfoConfig.propertiesFile=/tmp/buildinfo7190716564757927131properties artifactoryPublish
... in: /opt/bamboo-home/xml-data/build-dir/REACTOR-RAERON-AERON
... using extra environment variables:
bamboo_planRepository_1_branch=master
IRBRC=/home/bamboo/.rvm/rubies/ruby-2.3.0/.irbrc
bamboo_signing_store_password=********
bamboo_capability_system_builder_ant_Ant_1_9=/opt/ant-1.9
bamboo_capability_system_builder_ant_Ant_1_8=/opt/ant-1.8
bamboo_planRepository_1_branchDisplayName=master
bamboo_repository_revision_number=cbfb4b43e04c18f5d63fe036ff1b31f56d5626eb
bamboo_repository_206307339_git_username=smaldini
bamboo_RIAK_BIN=/usr/sbin/riak
bamboo_capability_system_builder_node_Node_js_6=/usr/bin/node
WRAPPER_BITS=32
bamboo_buildKey=REACTOR-RAERON-AERON
rvm_loaded_flag=1
bamboo_repository_206307339_branch_name=master
bamboo_sonar_token_password=********
rvm_version=1.27.0 (latest)
PWD=/opt/bamboo-home/bin
bamboo_shortJobName=Aeron
bamboo_buildResultsUrl=https://build.spring.io/browse/REACTOR-RAERON-AERON-630
bamboo_capability_system_builder_gradle___gradlew=./gradlew
bamboo_capability_system_builder_mvn3_Maven_3_3=/opt/maven-3.3
bamboo_capability_system_builder_mvn3_Maven_3_2=/opt/maven-3.2
bamboo_planRepository_repositoryUrl=https://github.com/reactor/reactor-aeron.git
bamboo_capability_system_builder_mvn3_Maven_3_1=/opt/maven-3.1
bamboo_capability_system_builder_mvn3_Maven_3_5=/opt/maven-3.5
bamboo_agentId=208568329
MY_RUBY_HOME=/home/bamboo/.rvm/rubies/ruby-2.3.0
bamboo_capability_system_builder_mvn3_Maven_3_0=/opt/maven-3.0
rvm_path=/home/bamboo/.rvm
bamboo_planRepository_revision=cbfb4b43e04c18f5d63fe036ff1b31f56d5626eb
bamboo_planRepository_previousRevision=9731d4de06c96d472c75e1e24aab94e6496bc60b
bamboo_capability_remote_build=true
bamboo_repository_branch_name=master
bamboo_repository_206307339_previous_revision_number=9731d4de06c96d472c75e1e24aab94e6496bc60b
SHLVL=1
bamboo_org_jfrog_bamboo_buildInfo_serverUrl=https://repo.spring.io
bamboo_scdf_acceptance_tests_password=********
WRAPPER_OS=linux
JAVA_HOME=/opt/jdk-8/
EC2_HOME=/opt/ec2-api-tools
XDG_SESSION_ID=c1
bamboo_planRepository_branch=master
bamboo_org_jfrog_bamboo_release_activated=false
bamboo_planRepository_1_type=gh
bamboo_planRepository_branchName=master
WRAPPER_FILE_SEPARATOR=/
_=/opt/bamboo-home/bin/bamboo-agent.sh
WRAPPER_PATH_SEPARATOR=:
bamboo_sonar_password=********
bamboo_planRepository_type=gh
bamboo_planRepository_1_username=smaldini
rvm_stored_umask=0002
GEM_PATH=/home/bamboo/.rvm/gems/ruby-2.3.0:/home/bamboo/.rvm/gems/ruby-2.3.0@global
bamboo_planKey=REACTOR-RAERON
bamboo_JDK8_HOME=/opt/jdk-8
bamboo_planRepository_username=smaldini
NLSPATH=/usr/dt/lib/nls/msg/%L/%N.cat
bamboo_planRepository_1_branchName=master
bamboo_sonar_version=5.6.3
bamboo_repository_206307339_git_repositoryUrl=https://github.com/reactor/reactor-aeron.git
bamboo_resultsUrl=https://build.spring.io/browse/REACTOR-RAERON-AERON-630
bamboo_planRepository_1_name=reactor-aeron
bamboo_build_working_directory=/opt/bamboo-home/xml-data/build-dir/REACTOR-RAERON-AERON
bamboo_capability_system_os=ubuntu1604
bamboo_nexusPush_stagingProfile=buildmaster
bamboo_shortPlanName=Reactor Aeron
MAIL=/var/mail/bamboo
bamboo_planRepository_name=reactor-aeron
LOGNAME=bamboo
bamboo_buildNumber=630
bamboo_repository_206307339_name=reactor-aeron
rvm_user_install_flag=1
bamboo_repository_206307339_git_branch=master
SHELL=/bin/bash
bamboo_JDK7_HOME=/opt/jdk-7
bamboo_planName=Project Reactor - Reactor Aeron
bamboo_shortPlanKey=RAERON
OLDPWD=/opt/users/bamboo
GEM_HOME=/home/bamboo/.rvm/gems/ruby-2.3.0
bamboo_shortJobKey=AERON
bamboo_repository_previous_revision_number=9731d4de06c96d472c75e1e24aab94e6496bc60b
bamboo_buildTimeStamp=2017-10-22T15:51:35.128Z
RUBY_VERSION=ruby-2.3.0
bamboo_sonar_username=buildmaster
_system_name=Ubuntu
bamboo_buildResultKey=REACTOR-RAERON-AERON-630
bamboo_repository_git_branch=master
bamboo_nexusPush_close=true
bamboo_buildPlanName=Project Reactor - Reactor Aeron - Aeron
bamboo_planRepository_1_revision=cbfb4b43e04c18f5d63fe036ff1b31f56d5626eb
_system_arch=x86_64
bamboo_repository_name=reactor-aeron
rvm_bin_path=/home/bamboo/.rvm/bin
bamboo_signing_key_password=********
XFILESEARCHPATH=/usr/dt/app-defaults/%L/Dt
rvm_prefix=/home/bamboo
LANG=en_US.UTF-8
bamboo_capability_system_docker_executable=/usr/bin/docker
DISPLAY=localhost:1.0
bamboo_capability_system_builder_groovy_Groovy_2_4=/opt/groovy-2.4
bamboo_capability_system_builder_command_Bash=/bin/bash
bamboo_agentWorkingDirectory=/opt/bamboo-home/xml-data/build-dir
bamboo_capability_system_git_executable=/usr/bin/git
bamboo_planRepository_1_previousRevision=9731d4de06c96d472c75e1e24aab94e6496bc60b
bamboo_repository_git_username=smaldini
bamboo_capability_os_family=unix
NVM_NODEJS_ORG_MIRROR=http://nodejs.org/dist
bamboo_planRepository_branchDisplayName=master
NODE_PATH=/usr/lib/nodejs:/usr/lib/node_modules:/usr/share/javascript
bamboo_capability_system_builder_maven_Artifactory_Maven_3_5=/opt/maven-3.5
GIT_SSL_NO_VERIFY=true
bamboo_capability_system_builder_maven_Artifactory_Maven_3_3=/opt/maven-3.3
NVM_DIR=/home/bamboo/.nvm
bamboo_s3_properties=/home/bamboo/tools/s3.properties
bamboo_capability_system_builder_maven_Artifactory_Maven_3_2=/opt/maven-3.2
bamboo_capability_system_builder_maven_Artifactory_Maven_3_1=/opt/maven-3.1
bamboo_capability_system_builder_maven_Artifactory_Maven_3_0=/opt/maven-3.0
_system_type=Linux
bamboo_plan_storageTag=REACTOR-RAERON
_system_version=16.04
USER=bamboo
bamboo_repository_git_repositoryUrl=https://github.com/reactor/reactor-aeron.git
bamboo_repository_206307339_revision_number=cbfb4b43e04c18f5d63fe036ff1b31f56d5626eb
bamboo_org_jfrog_bamboo_buildInfo_activated=true
bamboo_working_directory=/opt/bamboo-home/xml-data/build-dir/REACTOR-RAERON-AERON
bamboo_planRepository_1_repositoryUrl=https://github.com/reactor/reactor-aeron.git
bamboo_capability_system_jdk_JDK_1_8=/opt/jdk-8
bamboo_capability_system_jdk_JDK_1_9=/opt/jdk-9
WRAPPER_ARCH=x86
bamboo_capability_system_jdk_JDK_1_6=/opt/jdk-6
bamboo_sonar_ip=10.194.6.9
bamboo_capability_system_jdk_JDK_1_7=/opt/jdk-7
XDG_RUNTIME_DIR=/run/user/505
HOME=/home/bamboo
PATH=/bin:/home/bamboo/.rvm/gems/ruby-2.3.0/bin:/home/bamboo/.rvm/gems/ruby-2.3.0@global/bin:/home/bamboo/.rvm/rubies/ruby-2.3.0/bin:/home/bamboo/bin:/usr/local/bin:/usr/bin:/bin:/usr/local/games:/usr/games:/snap/bin:/home/bamboo/bin:/usr/local/bin:/opt/ec2-api-tools/bin:/home/bamboo/.rvm/bin:/bin:/home/bamboo/.rvm/gems/ruby-2.3.0/bin:/home/bamboo/.rvm/gems/ruby-2.3.0@global/bin:/home/bamboo/.rvm/rubies/ruby-2.3.0/bin:/home/bamboo/bin:/usr/local/bin:/usr/bin:/bin:/usr/local/games:/usr/games:/snap/bin:/home/bamboo/bin:/usr/local/bin:/opt/ec2-api-tools/bin:/home/bamboo/.rvm/bin
22-Oct-2017 15:51:37 Initialized native services in: /opt/users/bamboo/.gradle/native
22-Oct-2017 15:51:38 Removing 0 daemon stop events from registry
22-Oct-2017 15:51:38 Starting a Gradle Daemon (subsequent builds will be faster)
22-Oct-2017 15:51:38 Starting daemon process: workingDir = /opt/users/bamboo/.gradle/daemon/3.5, daemonArgs: [/opt/jdk1.8.0_144/bin/java, -XX:MaxPermSize=256m, -XX:+HeapDumpOnOutOfMemoryError, -Xmx1024m, -Dfile.encoding=UTF-8, -Duser.country=US, -Duser.language=en, -Duser.variant, -cp, /home/bamboo/.gradle/wrapper/dists/gradle-3.5-bin/daoimhu7k5rlo48ntmxw2ok3e/gradle-3.5/lib/gradle-launcher-3.5.jar, org.gradle.launcher.daemon.bootstrap.GradleDaemon, 3.5]
22-Oct-2017 15:51:38 Starting process 'Gradle build daemon'. Working directory: /opt/users/bamboo/.gradle/daemon/3.5 Command: /opt/jdk1.8.0_144/bin/java -XX:MaxPermSize=256m -XX:+HeapDumpOnOutOfMemoryError -Xmx1024m -Dfile.encoding=UTF-8 -Duser.country=US -Duser.language=en -Duser.variant -cp /home/bamboo/.gradle/wrapper/dists/gradle-3.5-bin/daoimhu7k5rlo48ntmxw2ok3e/gradle-3.5/lib/gradle-launcher-3.5.jar org.gradle.launcher.daemon.bootstrap.GradleDaemon 3.5
22-Oct-2017 15:51:38 Successfully started process 'Gradle build daemon'
22-Oct-2017 15:51:39 An attempt to start the daemon took 0.755 secs.
22-Oct-2017 15:51:39 Connected to daemon DaemonInfo{pid=20149, address=[4e37b6bf-edd1-449a-ae2c-7a5eb37bcf9a port:46204, addresses:[/0:0:0:0:0:0:0:1, /127.0.0.1]], state=Busy, lastBusy=1508687499314, context=DefaultDaemonContext[uid=7137994e-5708-43f8-9e5b-24761726af17,javaHome=/opt/jdk1.8.0_144,daemonRegistryDir=/opt/users/bamboo/.gradle/daemon,pid=20149,idleTimeout=10800000,daemonOpts=-XX:MaxPermSize=256m,-XX:+HeapDumpOnOutOfMemoryError,-Xmx1024m,-Dfile.encoding=UTF-8,-Duser.country=US,-Duser.language=en,-Duser.variant]}. Dispatching request Build{id=d92212ec-78a0-4dc5-95b4-9350bf4c1750.1, currentDir=/opt/bamboo-home/xml-data/build-dir/REACTOR-RAERON-AERON}.
22-Oct-2017 15:51:39 Received result org.gradle.launcher.daemon.protocol.BuildStarted@16fdec90 from daemon DaemonInfo{pid=20149, address=[4e37b6bf-edd1-449a-ae2c-7a5eb37bcf9a port:46204, addresses:[/0:0:0:0:0:0:0:1, /127.0.0.1]], state=Busy, lastBusy=1508687499314, context=DefaultDaemonContext[uid=7137994e-5708-43f8-9e5b-24761726af17,javaHome=/opt/jdk1.8.0_144,daemonRegistryDir=/opt/users/bamboo/.gradle/daemon,pid=20149,idleTimeout=10800000,daemonOpts=-XX:MaxPermSize=256m,-XX:+HeapDumpOnOutOfMemoryError,-Xmx1024m,-Dfile.encoding=UTF-8,-Duser.country=US,-Duser.language=en,-Duser.variant]} (build should be starting).
22-Oct-2017 15:51:39 The client will now receive all logging from the daemon (pid: 20149). The daemon log file: /opt/users/bamboo/.gradle/daemon/3.5/daemon-20149.out.log
22-Oct-2017 15:51:39 Starting build in new daemon [memory: 954.7 MB]
22-Oct-2017 15:51:39 Executing build with daemon context: DefaultDaemonContext[uid=7137994e-5708-43f8-9e5b-24761726af17,javaHome=/opt/jdk1.8.0_144,daemonRegistryDir=/opt/users/bamboo/.gradle/daemon,pid=20149,idleTimeout=10800000,daemonOpts=-XX:MaxPermSize=256m,-XX:+HeapDumpOnOutOfMemoryError,-Xmx1024m,-Dfile.encoding=UTF-8,-Duser.country=US,-Duser.language=en,-Duser.variant]
22-Oct-2017 15:51:39 Creating new cache for fileHashes, path /opt/users/bamboo/.gradle/caches/3.5/fileHashes/fileHashes.bin, access org.gradle.cache.internal.DefaultCacheAccess@e2e3ac1
22-Oct-2017 15:51:39 Creating new cache for jvmRuntimeClassSignatures, path /opt/users/bamboo/.gradle/caches/3.5/fileHashes/jvmRuntimeClassSignatures.bin, access org.gradle.cache.internal.DefaultCacheAccess@e2e3ac1
22-Oct-2017 15:51:39 Creating new cache for plugin-use-metadata, path /opt/users/bamboo/.gradle/caches/3.5/plugin-resolution/plugin-use-metadata.bin, access org.gradle.cache.internal.DefaultCacheAccess@3173911e
22-Oct-2017 15:51:39 Creating new cache for client-status, path /opt/users/bamboo/.gradle/caches/3.5/plugin-resolution/client-status.bin, access org.gradle.cache.internal.DefaultCacheAccess@3173911e
22-Oct-2017 15:51:40 Starting Build
22-Oct-2017 15:51:40 Compiling initialization script '/tmp/artifactory.init.script5470759177918777128gradle' using SubsetScriptTransformer.
22-Oct-2017 15:51:41 Creating new cache for metadata-1.1/results, path /opt/users/bamboo/.gradle/caches/transforms-1/metadata-1.1/results.bin, access org.gradle.cache.internal.DefaultCacheAccess@59f2878f
22-Oct-2017 15:51:41 Compiling initialization script '/tmp/artifactory.init.script5470759177918777128gradle' using BuildScriptTransformer.
22-Oct-2017 15:51:42 Compiling settings file '/opt/bamboo-home/xml-data/build-dir/REACTOR-RAERON-AERON/settings.gradle' using SubsetScriptTransformer.
22-Oct-2017 15:51:42 Compiling settings file '/opt/bamboo-home/xml-data/build-dir/REACTOR-RAERON-AERON/settings.gradle' using BuildScriptTransformer.
22-Oct-2017 15:51:42 Settings evaluated using settings file '/opt/bamboo-home/xml-data/build-dir/REACTOR-RAERON-AERON/settings.gradle'.
22-Oct-2017 15:51:42 Projects loaded. Root project using build file '/opt/bamboo-home/xml-data/build-dir/REACTOR-RAERON-AERON/build.gradle'.
22-Oct-2017 15:51:42 Included projects: [root project 'reactor-aeron', project ':reactor-aeron-tools']
22-Oct-2017 15:51:42 Evaluating root project 'reactor-aeron' using build file '/opt/bamboo-home/xml-data/build-dir/REACTOR-RAERON-AERON/build.gradle'.
22-Oct-2017 15:51:42 Compiling build file '/opt/bamboo-home/xml-data/build-dir/REACTOR-RAERON-AERON/build.gradle' using SubsetScriptTransformer.
22-Oct-2017 15:51:43 Creating new cache for metadata-2.23/module-metadata, path /opt/users/bamboo/.gradle/caches/modules-2/metadata-2.23/module-metadata.bin, access org.gradle.cache.internal.DefaultCacheAccess@38d1cc0c
22-Oct-2017 15:51:43 Creating new cache for metadata-2.23/artifact-at-url, path /opt/users/bamboo/.gradle/caches/modules-2/metadata-2.23/artifact-at-url.bin, access org.gradle.cache.internal.DefaultCacheAccess@38d1cc0c
22-Oct-2017 15:51:44 Found locally available resource with matching checksum: [http://repo.spring.io/plugins-release/org/springframework/build/gradle/propdeps-plugin/0.0.7/propdeps-plugin-0.0.7.pom, /opt/users/bamboo/.gradle/caches/modules-2/files-2.1/org.springframework.build.gradle/propdeps-plugin/0.0.7/3f8de987cb92b3b39cfeec25aa75e47b427676b8/propdeps-plugin-0.0.7.pom]
22-Oct-2017 15:51:44 Found locally available resource with matching checksum: [http://repo.spring.io/plugins-release/io/spring/gradle/spring-io-plugin/0.0.4.RELEASE/spring-io-plugin-0.0.4.RELEASE.pom, /opt/users/bamboo/.gradle/caches/modules-2/files-2.1/io.spring.gradle/spring-io-plugin/0.0.4.RELEASE/af34c10a57968627e1d708f43c1d9c86f418e5c0/spring-io-plugin-0.0.4.RELEASE.pom]
22-Oct-2017 15:51:44 Download http://repo.spring.io/plugins-release/com/github/jengelman/gradle/plugins/shadow/1.2.0/shadow-1.2.0.pom
22-Oct-2017 15:51:44 Download http://repo.spring.io/plugins-release/org/asciidoctor/asciidoctorj-pdf/1.5.0-alpha.8/asciidoctorj-pdf-1.5.0-alpha.8.pom
22-Oct-2017 15:51:44 Found locally available resource with matching checksum: [http://repo.spring.io/plugins-release/org/asciidoctor/asciidoctor-gradle-plugin/1.5.2/asciidoctor-gradle-plugin-1.5.2.pom, /opt/users/bamboo/.gradle/caches/modules-2/files-2.1/org.asciidoctor/asciidoctor-gradle-plugin/1.5.2/3f886b57a9988e5a1d7aa685794d8541dd8e4f0e/asciidoctor-gradle-plugin-1.5.2.pom]
22-Oct-2017 15:51:44 Found locally available resource with matching checksum: [http://repo.spring.io/plugins-release/io/spring/gradle/dependency-management-plugin/0.5.3.RELEASE/dependency-management-plugin-0.5.3.RELEASE.pom, /opt/users/bamboo/.gradle/caches/modules-2/files-2.1/io.spring.gradle/dependency-management-plugin/0.5.3.RELEASE/c988eadcf6d0e9a7c42083635415f98e7316532b/dependency-management-plugin-0.5.3.RELEASE.pom]
22-Oct-2017 15:51:45 Download http://repo.spring.io/plugins-release/org/jdom/jdom2/2.0.5/jdom2-2.0.5.pom
22-Oct-2017 15:51:45 Found locally available resource with matching checksum: [http://repo.spring.io/plugins-release/org/ow2/asm/asm/5.0.3/asm-5.0.3.pom, /opt/users/bamboo/.gradle/caches/modules-2/files-2.1/org.ow2.asm/asm/5.0.3/7d9570aceff0131a35a87d37b53452be33cf3cd9/asm-5.0.3.pom]
22-Oct-2017 15:51:45 Found locally available resource with matching checksum: [http://repo.spring.io/plugins-release/org/ow2/asm/asm-parent/5.0.3/asm-parent-5.0.3.pom, /opt/users/bamboo/.gradle/caches/modules-2/files-2.1/org.ow2.asm/asm-parent/5.0.3/f2b915adcf47fab0e17bccf47390aa206eba7937/asm-parent-5.0.3.pom]
22-Oct-2017 15:51:45 Download http://repo.spring.io/plugins-release/org/ow2/ow2/1.3/ow2-1.3.pom
22-Oct-2017 15:51:45 Creating new cache for metadata-2.23/artifact-at-repository, path /opt/users/bamboo/.gradle/caches/modules-2/metadata-2.23/artifact-at-repository.bin, access org.gradle.cache.internal.DefaultCacheAccess@38d1cc0c
22-Oct-2017 15:51:45 Found locally available resource with matching checksum: [http://repo.spring.io/plugins-release/org/ow2/asm/asm-commons/5.0.3/asm-commons-5.0.3.pom, /home/bamboo/.m2/repository/org/ow2/asm/asm-commons/5.0.3/asm-commons-5.0.3.pom]
22-Oct-2017 15:51:45 Found locally available resource with matching checksum: [http://repo.spring.io/plugins-release/commons-io/commons-io/2.4/commons-io-2.4.pom, /home/bamboo/.m2/repository/commons-io/commons-io/2.4/commons-io-2.4.pom]
22-Oct-2017 15:51:45 Found locally available resource with matching checksum: [http://repo.spring.io/plugins-release/org/apache/commons/commons-parent/25/commons-parent-25.pom, /home/bamboo/.m2/repository/org/apache/commons/commons-parent/25/commons-parent-25.pom]
22-Oct-2017 15:51:46 Download http://repo.spring.io/plugins-release/org/apache/apache/9/apache-9.pom
22-Oct-2017 15:51:46 Found locally available resource with matching checksum: [http://repo.spring.io/plugins-release/org/apache/ant/ant/1.9.4/ant-1.9.4.pom, /home/bamboo/.m2/repository/org/apache/ant/ant/1.9.4/ant-1.9.4.pom]
22-Oct-2017 15:51:46 Found locally available resource with matching checksum: [http://repo.spring.io/plugins-release/org/apache/ant/ant-parent/1.9.4/ant-parent-1.9.4.pom, /home/bamboo/.m2/repository/org/apache/ant/ant-parent/1.9.4/ant-parent-1.9.4.pom]
22-Oct-2017 15:51:46 Found locally available resource with matching checksum: [http://repo.spring.io/plugins-release/org/asciidoctor/asciidoctorj/1.5.2/asciidoctorj-1.5.2.pom, /opt/users/bamboo/.gradle/caches/modules-2/files-2.1/org.asciidoctor/asciidoctorj/1.5.2/8cbab4fed50e0dcfa1adec4a7807fbcf00fc71d3/asciidoctorj-1.5.2.pom]
22-Oct-2017 15:51:46 Found locally available resource with matching checksum: [http://repo.spring.io/plugins-release/org/ow2/asm/asm-tree/5.0.3/asm-tree-5.0.3.pom, /home/bamboo/.m2/repository/org/ow2/asm/asm-tree/5.0.3/asm-tree-5.0.3.pom]
22-Oct-2017 15:51:46 Found locally available resource with matching checksum: [http://repo.spring.io/plugins-release/org/apache/ant/ant-launcher/1.9.4/ant-launcher-1.9.4.pom, /home/bamboo/.m2/repository/org/apache/ant/ant-launcher/1.9.4/ant-launcher-1.9.4.pom]
22-Oct-2017 15:51:46 Download http://repo.spring.io/plugins-release/org/jruby/jruby-complete/1.7.16.1/jruby-complete-1.7.16.1.pom
22-Oct-2017 15:51:47 Found locally available resource with matching checksum: [http://repo.spring.io/plugins-release/org/jruby/jruby-artifacts/1.7.16.1/jruby-artifacts-1.7.16.1.pom, /opt/users/bamboo/.gradle/caches/modules-2/files-2.1/org.jruby/jruby-artifacts/1.7.16.1/a631761218ce4efd9ec3b301d235189c2013a88a/jruby-artifacts-1.7.16.1.pom]
22-Oct-2017 15:51:47 Download http://repo.spring.io/plugins-release/org/jruby/jruby-parent/1.7.16.1/jruby-parent-1.7.16.1.pom
22-Oct-2017 15:51:47 Found locally available resource with matching checksum: [http://repo.spring.io/plugins-release/org/sonatype/oss/oss-parent/7/oss-parent-7.pom, /opt/users/bamboo/.gradle/caches/modules-2/files-2.1/org.sonatype.oss/oss-parent/7/aeb932c92796796d932798ded8d0ddc687cc557a/oss-parent-7.pom]
22-Oct-2017 15:51:47 Found locally available resource with matching checksum: [http://repo.spring.io/plugins-release/org/slf4j/slf4j-api/1.7.7/slf4j-api-1.7.7.pom, /opt/users/bamboo/.gradle/caches/modules-2/files-2.1/org.slf4j/slf4j-api/1.7.7/c52b4a857a0999d8f3688da24433ed421e3ce9c4/slf4j-api-1.7.7.pom]
22-Oct-2017 15:51:47 Found locally available resource with matching checksum: [http://repo.spring.io/plugins-release/org/slf4j/slf4j-parent/1.7.7/slf4j-parent-1.7.7.pom, /home/bamboo/.m2/repository/org/slf4j/slf4j-parent/1.7.7/slf4j-parent-1.7.7.pom]
22-Oct-2017 15:51:47 Found locally available resource with matching checksum: [http://repo.spring.io/plugins-release/com/beust/jcommander/1.35/jcommander-1.35.pom, /opt/users/bamboo/.gradle/caches/modules-2/files-2.1/com.beust/jcommander/1.35/643abcc29f656bfd9ff6b0c720264642bc10017f/jcommander-1.35.pom]
22-Oct-2017 15:51:47 Found locally available resource with matching checksum: [http://repo.spring.io/plugins-release/org/sonatype/oss/oss-parent/3/oss-parent-3.pom, /opt/users/bamboo/.gradle/caches/modules-2/files-2.1/org.sonatype.oss/oss-parent/3/7adcc185e6b6d3e4fee761918c7ecec0e5a0b392/oss-parent-3.pom]
22-Oct-2017 15:51:47 Found locally available resource with matching checksum: [http://repo.spring.io/plugins-release/org/springframework/build/gradle/propdeps-plugin/0.0.7/propdeps-plugin-0.0.7.jar, /opt/users/bamboo/.gradle/caches/modules-2/files-2.1/org.springframework.build.gradle/propdeps-plugin/0.0.7/bdb8785151682656a3396c1abbbf45811363db3f/propdeps-plugin-0.0.7.jar]
22-Oct-2017 15:51:48 Found locally available resource with matching checksum: [http://repo.spring.io/plugins-release/io/spring/gradle/spring-io-plugin/0.0.4.RELEASE/spring-io-plugin-0.0.4.RELEASE.jar, /opt/users/bamboo/.gradle/caches/modules-2/files-2.1/io.spring.gradle/spring-io-plugin/0.0.4.RELEASE/fa844d60b7a813a9f2af6fee826d3e2a786df1d6/spring-io-plugin-0.0.4.RELEASE.jar]
22-Oct-2017 15:51:48 Download http://repo.spring.io/plugins-release/com/github/jengelman/gradle/plugins/shadow/1.2.0/shadow-1.2.0.jar
22-Oct-2017 15:51:50 Download http://repo.spring.io/plugins-release/org/asciidoctor/asciidoctorj-pdf/1.5.0-alpha.8/asciidoctorj-pdf-1.5.0-alpha.8.jar
22-Oct-2017 15:51:50 Found locally available resource with matching checksum: [http://repo.spring.io/plugins-release/org/asciidoctor/asciidoctor-gradle-plugin/1.5.2/asciidoctor-gradle-plugin-1.5.2.jar, /opt/users/bamboo/.gradle/caches/modules-2/files-2.1/org.asciidoctor/asciidoctor-gradle-plugin/1.5.2/c0070557dd82b199d3755098fb48b8b9a2326e24/asciidoctor-gradle-plugin-1.5.2.jar]
22-Oct-2017 15:51:50 Found locally available resource with matching checksum: [http://repo.spring.io/plugins-release/io/spring/gradle/dependency-management-plugin/0.5.3.RELEASE/dependency-management-plugin-0.5.3.RELEASE.jar, /opt/users/bamboo/.gradle/caches/modules-2/files-2.1/io.spring.gradle/dependency-management-plugin/0.5.3.RELEASE/289f2d2c5de1237f5d15a0f460354236f33b25a/dependency-management-plugin-0.5.3.RELEASE.jar]
22-Oct-2017 15:51:51 Download http://repo.spring.io/plugins-release/org/jdom/jdom2/2.0.5/jdom2-2.0.5.jar
22-Oct-2017 15:51:51 Found locally available resource with matching checksum: [http://repo.spring.io/plugins-release/org/ow2/asm/asm/5.0.3/asm-5.0.3.jar, /opt/users/bamboo/.gradle/caches/modules-2/files-2.1/org.ow2.asm/asm/5.0.3/dcc2193db20e19e1feca8b1240dbbc4e190824fa/asm-5.0.3.jar]
22-Oct-2017 15:51:51 Found locally available resource with matching checksum: [http://repo.spring.io/plugins-release/org/ow2/asm/asm-commons/5.0.3/asm-commons-5.0.3.jar, /home/bamboo/.m2/repository/org/ow2/asm/asm-commons/5.0.3/asm-commons-5.0.3.jar]
22-Oct-2017 15:51:51 Found locally available resource with matching checksum: [http://repo.spring.io/plugins-release/commons-io/commons-io/2.4/commons-io-2.4.jar, /home/bamboo/.m2/repository/commons-io/commons-io/2.4/commons-io-2.4.jar]
22-Oct-2017 15:51:51 Found locally available resource with matching checksum: [http://repo.spring.io/plugins-release/org/apache/ant/ant/1.9.4/ant-1.9.4.jar, /home/bamboo/.m2/repository/org/apache/ant/ant/1.9.4/ant-1.9.4.jar]
22-Oct-2017 15:51:51 Found locally available resource with matching checksum: [http://repo.spring.io/plugins-release/org/asciidoctor/asciidoctorj/1.5.2/asciidoctorj-1.5.2.jar, /opt/users/bamboo/.gradle/caches/modules-2/files-2.1/org.asciidoctor/asciidoctorj/1.5.2/39d33f739ec1c46f6e908a725264eb74b23c9f99/asciidoctorj-1.5.2.jar]
22-Oct-2017 15:51:51 Found locally available resource with matching checksum: [http://repo.spring.io/plugins-release/org/ow2/asm/asm-tree/5.0.3/asm-tree-5.0.3.jar, /home/bamboo/.m2/repository/org/ow2/asm/asm-tree/5.0.3/asm-tree-5.0.3.jar]
22-Oct-2017 15:51:51 Found locally available resource with matching checksum: [http://repo.spring.io/plugins-release/org/apache/ant/ant-launcher/1.9.4/ant-launcher-1.9.4.jar, /home/bamboo/.m2/repository/org/apache/ant/ant-launcher/1.9.4/ant-launcher-1.9.4.jar]
22-Oct-2017 15:51:52 Found locally available resource with matching checksum: [http://repo.spring.io/plugins-release/org/jruby/jruby-complete/1.7.16.1/jruby-complete-1.7.16.1.jar, /opt/users/bamboo/.gradle/caches/modules-2/files-2.1/org.jruby/jruby-complete/1.7.16.1/b76682bd0966a31dab60dc5e275d8b28ac17c38f/jruby-complete-1.7.16.1.jar]
22-Oct-2017 15:51:52 Found locally available resource with matching checksum: [http://repo.spring.io/plugins-release/org/slf4j/slf4j-api/1.7.7/slf4j-api-1.7.7.jar, /opt/users/bamboo/.gradle/caches/modules-2/files-2.1/org.slf4j/slf4j-api/1.7.7/2b8019b6249bb05d81d3a3094e468753e2b21311/slf4j-api-1.7.7.jar]
22-Oct-2017 15:51:52 Found locally available resource with matching checksum: [http://repo.spring.io/plugins-release/com/beust/jcommander/1.35/jcommander-1.35.jar, /opt/users/bamboo/.gradle/caches/modules-2/files-2.1/com.beust/jcommander/1.35/47592e181b0bdbbeb63029e08c5e74f6803c4edd/jcommander-1.35.jar]
22-Oct-2017 15:51:53 Creating new cache for fileHashes, path /opt/bamboo-home/xml-data/build-dir/REACTOR-RAERON-AERON/.gradle/3.5/taskHistory/fileHashes.bin, access org.gradle.cache.internal.DefaultCacheAccess@166b20e4
22-Oct-2017 15:51:53 Compiling build file '/opt/bamboo-home/xml-data/build-dir/REACTOR-RAERON-AERON/build.gradle' using BuildScriptTransformer.
22-Oct-2017 15:51:53 Compiling script '/opt/bamboo-home/xml-data/build-dir/REACTOR-RAERON-AERON/gradle/setup.gradle' using SubsetScriptTransformer.
22-Oct-2017 15:51:53 Compiling script '/opt/bamboo-home/xml-data/build-dir/REACTOR-RAERON-AERON/gradle/setup.gradle' using BuildScriptTransformer.
22-Oct-2017 15:51:54 Using 4 worker leases.
22-Oct-2017 15:51:54 Compiling script '/opt/bamboo-home/xml-data/build-dir/REACTOR-RAERON-AERON/gradle/doc.gradle' using SubsetScriptTransformer.
22-Oct-2017 15:51:54 Compiling script '/opt/bamboo-home/xml-data/build-dir/REACTOR-RAERON-AERON/gradle/doc.gradle' using BuildScriptTransformer.
22-Oct-2017 15:51:55 Compiling script '/opt/bamboo-home/xml-data/build-dir/REACTOR-RAERON-AERON/gradle/ide.gradle' using SubsetScriptTransformer.
22-Oct-2017 15:51:55 Compiling script '/opt/bamboo-home/xml-data/build-dir/REACTOR-RAERON-AERON/gradle/ide.gradle' using BuildScriptTransformer.
22-Oct-2017 15:51:55 [Asciidoctor] asciidoctorj: 1.5.2
22-Oct-2017 15:51:55 [Asciidoctor] asciidoctorj-groovy-dsl: 1.0.0.preview2
22-Oct-2017 15:51:55 Evaluating project ':reactor-aeron-tools' using build file '/opt/bamboo-home/xml-data/build-dir/REACTOR-RAERON-AERON/reactor-aeron-tools/build.gradle'.
22-Oct-2017 15:51:55 All projects evaluated.
22-Oct-2017 15:51:55 No publish configurations specified for project ':' - using the default 'archives' configuration.
22-Oct-2017 15:51:55 No publish configurations specified for project ':reactor-aeron-tools' - using the default 'archives' configuration.
22-Oct-2017 15:51:55 Cannot publish pom for project ':reactor-aeron-tools' since it does not contain the Maven plugin install task and task ':reactor-aeron-tools:artifactoryPublish' does not specify a custom pom path.
22-Oct-2017 15:51:55 Cannot publish pom for project ':reactor-aeron-tools' since it does not contain the Maven plugin install task and task ':reactor-aeron-tools:artifactoryPublish' does not specify a custom pom path.
22-Oct-2017 15:51:55 Selected primary task 'clean' from project :
22-Oct-2017 15:51:55 Selected primary task 'test' from project :
22-Oct-2017 15:51:55 Creating new cache for annotation-processors, path /opt/bamboo-home/xml-data/build-dir/REACTOR-RAERON-AERON/.gradle/3.5/fileContent/annotation-processors.bin, access org.gradle.cache.internal.DefaultCacheAccess@2ffd217e
22-Oct-2017 15:51:55 Selected primary task 'assemble' from project :
22-Oct-2017 15:51:55 Selected primary task 'artifactoryPublish' from project :
22-Oct-2017 15:51:55 Tasks to be executed: [task ':clean', task ':reactor-aeron-tools:clean', task ':compileJava', task ':compileGroovy', task ':processResources', task ':classes', task ':compileTestJava', task ':compileTestGroovy', task ':processTestResources', task ':testClasses', task ':test', task ':jar', task ':reactor-aeron-tools:compileJava', task ':reactor-aeron-tools:compileGroovy', task ':reactor-aeron-tools:processResources', task ':reactor-aeron-tools:classes', task ':reactor-aeron-tools:compileTestJava', task ':reactor-aeron-tools:compileTestGroovy', task ':reactor-aeron-tools:processTestResources', task ':reactor-aeron-tools:testClasses', task ':reactor-aeron-tools:test', task ':javadoc', task ':javadocJar', task ':sourcesJar', task ':assemble', task ':reactor-aeron-tools:jar', task ':reactor-aeron-tools:assemble', task ':install', task ':uploadArchives', task ':reactor-aeron-tools:uploadArchives', task ':reactor-aeron-tools:artifactoryPublish', task ':artifactoryPublish']
22-Oct-2017 15:51:55 Creating new cache for jvmClassSignatures, path /opt/bamboo-home/xml-data/build-dir/REACTOR-RAERON-AERON/.gradle/3.5/taskHistory/jvmClassSignatures.bin, access org.gradle.cache.internal.DefaultCacheAccess@166b20e4
22-Oct-2017 15:51:55 Creating new cache for fileSnapshots, path /opt/bamboo-home/xml-data/build-dir/REACTOR-RAERON-AERON/.gradle/3.5/taskHistory/fileSnapshots.bin, access org.gradle.cache.internal.DefaultCacheAccess@166b20e4
22-Oct-2017 15:51:55 Creating new cache for taskHistory, path /opt/bamboo-home/xml-data/build-dir/REACTOR-RAERON-AERON/.gradle/3.5/taskHistory/taskHistory.bin, access org.gradle.cache.internal.DefaultCacheAccess@166b20e4
22-Oct-2017 15:51:55 :clean (Thread[Daemon worker,5,main]) started.
22-Oct-2017 15:51:55 :clean
22-Oct-2017 15:51:55 Putting task artifact state for task ':clean' into context took 0.0 secs.
22-Oct-2017 15:51:55 Executing task ':clean' (up-to-date check took 0.0 secs) due to:
22-Oct-2017 15:51:55   Task has not declared any outputs.
22-Oct-2017 15:51:55 :clean UP-TO-DATE
22-Oct-2017 15:51:55 :clean (Thread[Daemon worker,5,main]) completed. Took 0.006 secs.
22-Oct-2017 15:51:55 :reactor-aeron-tools:clean (Thread[Daemon worker,5,main]) started.
22-Oct-2017 15:51:55 :reactor-aeron-tools:clean
22-Oct-2017 15:51:55 Putting task artifact state for task ':reactor-aeron-tools:clean' into context took 0.0 secs.
22-Oct-2017 15:51:55 Executing task ':reactor-aeron-tools:clean' (up-to-date check took 0.0 secs) due to:
22-Oct-2017 15:51:55   Task has not declared any outputs.
22-Oct-2017 15:51:55 :reactor-aeron-tools:clean UP-TO-DATE
22-Oct-2017 15:51:55 :reactor-aeron-tools:clean (Thread[Daemon worker,5,main]) completed. Took 0.0 secs.
22-Oct-2017 15:51:55 :compileJava (Thread[Daemon worker,5,main]) started.
22-Oct-2017 15:51:55 :compileJava
22-Oct-2017 15:51:55 Putting task artifact state for task ':compileJava' into context took 0.004 secs.
22-Oct-2017 15:51:55 Task :compileJava class loader hash: 41621835a1ddfd325406e64eb3109d65
22-Oct-2017 15:51:55 Task :compileJava actions class loader hashes: [750e1d72030581ace81f7325929812f4, 41621835a1ddfd325406e64eb3109d65]
22-Oct-2017 15:51:56 Download https://jcenter.bintray.com/io/aeron/aeron-driver/1.4.0/aeron-driver-1.4.0.pom
22-Oct-2017 15:51:56 Download https://jcenter.bintray.com/io/aeron/aeron-client/1.4.0/aeron-client-1.4.0.pom
22-Oct-2017 15:51:56 Resource missing. [HTTP GET: https://jcenter.bintray.com/io/projectreactor/reactor-core/3.1.2.BUILD-SNAPSHOT/maven-metadata.xml]
22-Oct-2017 15:51:56 Resource missing. [HTTP GET: https://jcenter.bintray.com/io/projectreactor/reactor-core/3.1.2.BUILD-SNAPSHOT/reactor-core-3.1.2.BUILD-SNAPSHOT.pom]
22-Oct-2017 15:51:56 Resource missing. [HTTP HEAD: https://jcenter.bintray.com/io/projectreactor/reactor-core/3.1.2.BUILD-SNAPSHOT/reactor-core-3.1.2.BUILD-SNAPSHOT.jar]
22-Oct-2017 15:51:56 Resource missing. [HTTP GET: http://repo.spring.io/libs-milestone/io/projectreactor/reactor-core/3.1.2.BUILD-SNAPSHOT/maven-metadata.xml]
22-Oct-2017 15:51:56 Resource missing. [HTTP GET: http://repo.spring.io/libs-milestone/io/projectreactor/reactor-core/3.1.2.BUILD-SNAPSHOT/reactor-core-3.1.2.BUILD-SNAPSHOT.pom]
22-Oct-2017 15:51:56 Resource missing. [HTTP HEAD: http://repo.spring.io/libs-milestone/io/projectreactor/reactor-core/3.1.2.BUILD-SNAPSHOT/reactor-core-3.1.2.BUILD-SNAPSHOT.jar]
22-Oct-2017 15:51:57 Download http://repo.spring.io/libs-snapshot/io/projectreactor/reactor-core/3.1.2.BUILD-SNAPSHOT/reactor-core-3.1.2.BUILD-20171020.233352-1.pom
22-Oct-2017 15:51:57 Download https://jcenter.bintray.com/com/google/code/findbugs/jsr305/3.0.0/jsr305-3.0.0.pom
22-Oct-2017 15:51:57 Found locally available resource with matching checksum: [https://jcenter.bintray.com/org/slf4j/slf4j-api/1.7.12/slf4j-api-1.7.12.pom, /opt/users/bamboo/.gradle/caches/modules-2/files-2.1/org.slf4j/slf4j-api/1.7.12/1163b15d6680795fcc64a14e0c8426a3cc0825a3/slf4j-api-1.7.12.pom]
22-Oct-2017 15:51:57 Found locally available resource with matching checksum: [https://jcenter.bintray.com/org/slf4j/slf4j-parent/1.7.12/slf4j-parent-1.7.12.pom, /opt/users/bamboo/.gradle/caches/modules-2/files-2.1/org.slf4j/slf4j-parent/1.7.12/4ca3c2444d66ddf372411cdd5dc4d819531678bf/slf4j-parent-1.7.12.pom]
22-Oct-2017 15:51:57 Download https://jcenter.bintray.com/org/agrona/agrona/0.9.7/agrona-0.9.7.pom
22-Oct-2017 15:51:57 Found locally available resource with matching checksum: [https://jcenter.bintray.com/org/reactivestreams/reactive-streams/1.0.1/reactive-streams-1.0.1.pom, /home/bamboo/.m2/repository/org/reactivestreams/reactive-streams/1.0.1/reactive-streams-1.0.1.pom]
22-Oct-2017 15:51:57 Download https://jcenter.bintray.com/io/aeron/aeron-driver/1.4.0/aeron-driver-1.4.0.jar
22-Oct-2017 15:51:57 Download https://jcenter.bintray.com/io/aeron/aeron-client/1.4.0/aeron-client-1.4.0.jar
22-Oct-2017 15:51:59 Download http://repo.spring.io/libs-snapshot/io/projectreactor/reactor-core/3.1.2.BUILD-SNAPSHOT/reactor-core-3.1.2.BUILD-20171020.233352-1.jar
22-Oct-2017 15:51:59 Download https://jcenter.bintray.com/com/google/code/findbugs/jsr305/3.0.0/jsr305-3.0.0.jar
22-Oct-2017 15:51:59 Found locally available resource with matching checksum: [https://jcenter.bintray.com/org/slf4j/slf4j-api/1.7.12/slf4j-api-1.7.12.jar, /opt/users/bamboo/.gradle/caches/modules-2/files-2.1/org.slf4j/slf4j-api/1.7.12/8e20852d05222dc286bf1c71d78d0531e177c317/slf4j-api-1.7.12.jar]
22-Oct-2017 15:51:59 Download https://jcenter.bintray.com/org/agrona/agrona/0.9.7/agrona-0.9.7.jar
22-Oct-2017 15:51:59 Found locally available resource with matching checksum: [https://jcenter.bintray.com/org/reactivestreams/reactive-streams/1.0.1/reactive-streams-1.0.1.jar, /home/bamboo/.m2/repository/org/reactivestreams/reactive-streams/1.0.1/reactive-streams-1.0.1.jar]
22-Oct-2017 15:52:00 Executing task ':compileJava' (up-to-date check took 4.367 secs) due to:
22-Oct-2017 15:52:00   No history is available.
22-Oct-2017 15:52:00 All input files are considered out-of-date for incremental task ':compileJava'.
22-Oct-2017 15:52:00 Compiling with JDK Java compiler API.
22-Oct-2017 15:52:01 :compileJava (Thread[Daemon worker,5,main]) completed. Took 5.694 secs.
22-Oct-2017 15:52:01 :compileGroovy (Thread[Daemon worker,5,main]) started.
22-Oct-2017 15:52:01 :compileGroovy
22-Oct-2017 15:52:01 Putting task artifact state for task ':compileGroovy' into context took 0.001 secs.
22-Oct-2017 15:52:01 file or directory '/opt/bamboo-home/xml-data/build-dir/REACTOR-RAERON-AERON/src/main/groovy', not found
22-Oct-2017 15:52:01 Skipping task ':compileGroovy' as it has no source files and no previous output files.
22-Oct-2017 15:52:01 :compileGroovy NO-SOURCE
22-Oct-2017 15:52:01 :compileGroovy (Thread[Daemon worker,5,main]) completed. Took 0.003 secs.
22-Oct-2017 15:52:01 :processResources (Thread[Daemon worker,5,main]) started.
22-Oct-2017 15:52:01 :processResources
22-Oct-2017 15:52:01 Putting task artifact state for task ':processResources' into context took 0.001 secs.
22-Oct-2017 15:52:01 file or directory '/opt/bamboo-home/xml-data/build-dir/REACTOR-RAERON-AERON/src/main/resources', not found
22-Oct-2017 15:52:01 Skipping task ':processResources' as it has no source files and no previous output files.
22-Oct-2017 15:52:01 :processResources NO-SOURCE
22-Oct-2017 15:52:01 :processResources (Thread[Daemon worker,5,main]) completed. Took 0.003 secs.
22-Oct-2017 15:52:01 :classes (Thread[Daemon worker,5,main]) started.
22-Oct-2017 15:52:01 :classes
22-Oct-2017 15:52:01 Skipping task ':classes' as it has no actions.
22-Oct-2017 15:52:01 :classes (Thread[Daemon worker,5,main]) completed. Took 0.003 secs.
22-Oct-2017 15:52:01 :compileTestJava (Thread[Daemon worker,5,main]) started.
22-Oct-2017 15:52:01 :compileTestJava
22-Oct-2017 15:52:01 Putting task artifact state for task ':compileTestJava' into context took 0.0 secs.
22-Oct-2017 15:52:01 Task :compileTestJava class loader hash: 41621835a1ddfd325406e64eb3109d65
22-Oct-2017 15:52:01 Task :compileTestJava actions class loader hashes: [750e1d72030581ace81f7325929812f4, 41621835a1ddfd325406e64eb3109d65]
22-Oct-2017 15:52:01 Found locally available resource with matching checksum: [https://jcenter.bintray.com/junit/junit/4.12/junit-4.12.pom, /opt/users/bamboo/.gradle/caches/modules-2/files-2.1/junit/junit/4.12/35fb238baee3f3af739074d723279ebea2028398/junit-4.12.pom]
22-Oct-2017 15:52:01 Resource missing. [HTTP GET: https://jcenter.bintray.com/io/projectreactor/reactor-test/3.1.2.BUILD-SNAPSHOT/maven-metadata.xml]
22-Oct-2017 15:52:02 Resource missing. [HTTP GET: https://jcenter.bintray.com/io/projectreactor/reactor-test/3.1.2.BUILD-SNAPSHOT/reactor-test-3.1.2.BUILD-SNAPSHOT.pom]
22-Oct-2017 15:52:02 Resource missing. [HTTP HEAD: https://jcenter.bintray.com/io/projectreactor/reactor-test/3.1.2.BUILD-SNAPSHOT/reactor-test-3.1.2.BUILD-SNAPSHOT.jar]
22-Oct-2017 15:52:02 Resource missing. [HTTP GET: http://repo.spring.io/libs-milestone/io/projectreactor/reactor-test/3.1.2.BUILD-SNAPSHOT/maven-metadata.xml]
22-Oct-2017 15:52:02 Resource missing. [HTTP GET: http://repo.spring.io/libs-milestone/io/projectreactor/reactor-test/3.1.2.BUILD-SNAPSHOT/reactor-test-3.1.2.BUILD-SNAPSHOT.pom]
22-Oct-2017 15:52:02 Resource missing. [HTTP HEAD: http://repo.spring.io/libs-milestone/io/projectreactor/reactor-test/3.1.2.BUILD-SNAPSHOT/reactor-test-3.1.2.BUILD-SNAPSHOT.jar]
22-Oct-2017 15:52:02 Download http://repo.spring.io/libs-snapshot/io/projectreactor/reactor-test/3.1.2.BUILD-SNAPSHOT/reactor-test-3.1.2.BUILD-20171020.233352-1.pom
22-Oct-2017 15:52:02 Found locally available resource with matching checksum: [https://jcenter.bintray.com/org/hamcrest/hamcrest-library/1.3/hamcrest-library-1.3.pom, /opt/users/bamboo/.gradle/caches/modules-2/files-2.1/org.hamcrest/hamcrest-library/1.3/8e2a1dd4d5ba590c7a904209f1f40f66d9349ee9/hamcrest-library-1.3.pom]
22-Oct-2017 15:52:03 Found locally available resource with matching checksum: [https://jcenter.bintray.com/org/hamcrest/hamcrest-parent/1.3/hamcrest-parent-1.3.pom, /opt/users/bamboo/.gradle/caches/modules-2/files-2.1/org.hamcrest/hamcrest-parent/1.3/80391bd32bfa4837a15215d5e9f07c60555c379a/hamcrest-parent-1.3.pom]
22-Oct-2017 15:52:03 Download https://jcenter.bintray.com/org/assertj/assertj-core/3.6.1/assertj-core-3.6.1.pom
22-Oct-2017 15:52:03 Found locally available resource with matching checksum: [https://jcenter.bintray.com/org/assertj/assertj-parent-pom/2.1.4/assertj-parent-pom-2.1.4.pom, /opt/users/bamboo/.gradle/caches/modules-2/files-2.1/org.assertj/assertj-parent-pom/2.1.4/eb46c0f43b82d7e50ff5ae9015524e955bf5032d/assertj-parent-pom-2.1.4.pom]
22-Oct-2017 15:52:03 Found locally available resource with matching checksum: [https://jcenter.bintray.com/org/mockito/mockito-core/2.7.22/mockito-core-2.7.22.pom, /home/bamboo/.m2/repository/org/mockito/mockito-core/2.7.22/mockito-core-2.7.22.pom]
22-Oct-2017 15:52:03 Found locally available resource with matching checksum: [https://jcenter.bintray.com/org/hamcrest/hamcrest-core/1.3/hamcrest-core-1.3.pom, /opt/users/bamboo/.gradle/caches/modules-2/files-2.1/org.hamcrest/hamcrest-core/1.3/872e413497b906e7c9fa85ccc96046c5d1ef7ece/hamcrest-core-1.3.pom]
22-Oct-2017 15:52:03 Download https://jcenter.bintray.com/net/bytebuddy/byte-buddy/1.6.11/byte-buddy-1.6.11.pom
22-Oct-2017 15:52:03 Found locally available resource with matching checksum: [https://jcenter.bintray.com/net/bytebuddy/byte-buddy-parent/1.6.11/byte-buddy-parent-1.6.11.pom, /home/bamboo/.m2/repository/net/bytebuddy/byte-buddy-parent/1.6.11/byte-buddy-parent-1.6.11.pom]
22-Oct-2017 15:52:03 Found locally available resource with matching checksum: [https://jcenter.bintray.com/net/bytebuddy/byte-buddy-agent/1.6.11/byte-buddy-agent-1.6.11.pom, /home/bamboo/.m2/repository/net/bytebuddy/byte-buddy-agent/1.6.11/byte-buddy-agent-1.6.11.pom]
22-Oct-2017 15:52:03 Found locally available resource with matching checksum: [https://jcenter.bintray.com/org/objenesis/objenesis/2.5/objenesis-2.5.pom, /home/bamboo/.m2/repository/org/objenesis/objenesis/2.5/objenesis-2.5.pom]
22-Oct-2017 15:52:03 Found locally available resource with matching checksum: [https://jcenter.bintray.com/org/objenesis/objenesis-parent/2.5/objenesis-parent-2.5.pom, /home/bamboo/.m2/repository/org/objenesis/objenesis-parent/2.5/objenesis-parent-2.5.pom]
22-Oct-2017 15:52:03 Found locally available resource with matching checksum: [https://jcenter.bintray.com/junit/junit/4.12/junit-4.12.jar, /opt/users/bamboo/.gradle/caches/modules-2/files-2.1/junit/junit/4.12/2973d150c0dc1fefe998f834810d68f278ea58ec/junit-4.12.jar]
22-Oct-2017 15:52:03 Download http://repo.spring.io/libs-snapshot/io/projectreactor/reactor-test/3.1.2.BUILD-SNAPSHOT/reactor-test-3.1.2.BUILD-20171020.233352-1.jar
22-Oct-2017 15:52:03 Found locally available resource with matching checksum: [https://jcenter.bintray.com/org/hamcrest/hamcrest-library/1.3/hamcrest-library-1.3.jar, /opt/users/bamboo/.gradle/caches/modules-2/files-2.1/org.hamcrest/hamcrest-library/1.3/4785a3c21320980282f9f33d0d1264a69040538f/hamcrest-library-1.3.jar]
22-Oct-2017 15:52:04 Download https://jcenter.bintray.com/org/assertj/assertj-core/3.6.1/assertj-core-3.6.1.jar
22-Oct-2017 15:52:04 Found locally available resource with matching checksum: [https://jcenter.bintray.com/org/mockito/mockito-core/2.7.22/mockito-core-2.7.22.jar, /home/bamboo/.m2/repository/org/mockito/mockito-core/2.7.22/mockito-core-2.7.22.jar]
22-Oct-2017 15:52:04 Found locally available resource with matching checksum: [https://jcenter.bintray.com/org/hamcrest/hamcrest-core/1.3/hamcrest-core-1.3.jar, /opt/users/bamboo/.gradle/caches/modules-2/files-2.1/org.hamcrest/hamcrest-core/1.3/42a25dc3219429f0e5d060061f71acb49bf010a0/hamcrest-core-1.3.jar]
22-Oct-2017 15:52:04 Download https://jcenter.bintray.com/net/bytebuddy/byte-buddy/1.6.11/byte-buddy-1.6.11.jar
22-Oct-2017 15:52:04 Found locally available resource with matching checksum: [https://jcenter.bintray.com/net/bytebuddy/byte-buddy-agent/1.6.11/byte-buddy-agent-1.6.11.jar, /home/bamboo/.m2/repository/net/bytebuddy/byte-buddy-agent/1.6.11/byte-buddy-agent-1.6.11.jar]
22-Oct-2017 15:52:04 Found locally available resource with matching checksum: [https://jcenter.bintray.com/org/objenesis/objenesis/2.5/objenesis-2.5.jar, /home/bamboo/.m2/repository/org/objenesis/objenesis/2.5/objenesis-2.5.jar]
22-Oct-2017 15:52:04 Executing task ':compileTestJava' (up-to-date check took 3.374 secs) due to:
22-Oct-2017 15:52:04   No history is available.
22-Oct-2017 15:52:04 All input files are considered out-of-date for incremental task ':compileTestJava'.
22-Oct-2017 15:52:04 Compiling with JDK Java compiler API.
22-Oct-2017 15:52:05 :compileTestJava (Thread[Daemon worker,5,main]) completed. Took 3.694 secs.
22-Oct-2017 15:52:05 :compileTestGroovy (Thread[Daemon worker,5,main]) started.
22-Oct-2017 15:52:05 :compileTestGroovy
22-Oct-2017 15:52:05 Putting task artifact state for task ':compileTestGroovy' into context took 0.001 secs.
22-Oct-2017 15:52:05 file or directory '/opt/bamboo-home/xml-data/build-dir/REACTOR-RAERON-AERON/src/test/groovy', not found
22-Oct-2017 15:52:05 Skipping task ':compileTestGroovy' as it has no source files and no previous output files.
22-Oct-2017 15:52:05 :compileTestGroovy NO-SOURCE
22-Oct-2017 15:52:05 :compileTestGroovy (Thread[Daemon worker,5,main]) completed. Took 0.001 secs.
22-Oct-2017 15:52:05 :processTestResources (Thread[Daemon worker,5,main]) started.
22-Oct-2017 15:52:05 :processTestResources
22-Oct-2017 15:52:05 Putting task artifact state for task ':processTestResources' into context took 0.001 secs.
22-Oct-2017 15:52:05 file or directory '/opt/bamboo-home/xml-data/build-dir/REACTOR-RAERON-AERON/src/test/resources', not found
22-Oct-2017 15:52:05 Skipping task ':processTestResources' as it has no source files and no previous output files.
22-Oct-2017 15:52:05 :processTestResources NO-SOURCE
22-Oct-2017 15:52:05 :processTestResources (Thread[Daemon worker,5,main]) completed. Took 0.005 secs.
22-Oct-2017 15:52:05 :testClasses (Thread[Daemon worker,5,main]) started.
22-Oct-2017 15:52:05 :testClasses
22-Oct-2017 15:52:05 Skipping task ':testClasses' as it has no actions.
22-Oct-2017 15:52:05 :testClasses (Thread[Daemon worker,5,main]) completed. Took 0.0 secs.
22-Oct-2017 15:52:05 :test (Thread[Daemon worker,5,main]) started.
22-Oct-2017 15:52:05 :test
22-Oct-2017 15:52:05 Putting task artifact state for task ':test' into context took 0.002 secs.
22-Oct-2017 15:52:05 Task :test class loader hash: 41621835a1ddfd325406e64eb3109d65
22-Oct-2017 15:52:05 Task :test actions class loader hashes: [750e1d72030581ace81f7325929812f4, 41621835a1ddfd325406e64eb3109d65]
22-Oct-2017 15:52:05 Found locally available resource with matching checksum: [https://jcenter.bintray.com/ch/qos/logback/logback-classic/1.1.5/logback-classic-1.1.5.pom, /home/bamboo/.m2/repository/ch/qos/logback/logback-classic/1.1.5/logback-classic-1.1.5.pom]
22-Oct-2017 15:52:05 Found locally available resource with matching checksum: [https://jcenter.bintray.com/ch/qos/logback/logback-parent/1.1.5/logback-parent-1.1.5.pom, /home/bamboo/.m2/repository/ch/qos/logback/logback-parent/1.1.5/logback-parent-1.1.5.pom]
22-Oct-2017 15:52:05 Found locally available resource with matching checksum: [https://jcenter.bintray.com/ch/qos/logback/logback-core/1.1.5/logback-core-1.1.5.pom, /home/bamboo/.m2/repository/ch/qos/logback/logback-core/1.1.5/logback-core-1.1.5.pom]
22-Oct-2017 15:52:05 Found locally available resource with matching checksum: [https://jcenter.bintray.com/org/slf4j/slf4j-api/1.7.16/slf4j-api-1.7.16.pom, /home/bamboo/.m2/repository/org/slf4j/slf4j-api/1.7.16/slf4j-api-1.7.16.pom]
22-Oct-2017 15:52:05 Found locally available resource with matching checksum: [https://jcenter.bintray.com/org/slf4j/slf4j-parent/1.7.16/slf4j-parent-1.7.16.pom, /home/bamboo/.m2/repository/org/slf4j/slf4j-parent/1.7.16/slf4j-parent-1.7.16.pom]
22-Oct-2017 15:52:05 Found locally available resource with matching checksum: [https://jcenter.bintray.com/ch/qos/logback/logback-classic/1.1.5/logback-classic-1.1.5.jar, /home/bamboo/.m2/repository/ch/qos/logback/logback-classic/1.1.5/logback-classic-1.1.5.jar]
22-Oct-2017 15:52:05 Found locally available resource with matching checksum: [https://jcenter.bintray.com/ch/qos/logback/logback-core/1.1.5/logback-core-1.1.5.jar, /home/bamboo/.m2/repository/ch/qos/logback/logback-core/1.1.5/logback-core-1.1.5.jar]
22-Oct-2017 15:52:05 Found locally available resource with matching checksum: [https://jcenter.bintray.com/org/slf4j/slf4j-api/1.7.16/slf4j-api-1.7.16.jar, /home/bamboo/.m2/repository/org/slf4j/slf4j-api/1.7.16/slf4j-api-1.7.16.jar]
22-Oct-2017 15:52:06 Executing task ':test' (up-to-date check took 0.803 secs) due to:
22-Oct-2017 15:52:06   No history is available.
22-Oct-2017 15:52:06 Starting process 'Gradle Test Executor 1'. Working directory: /opt/bamboo-home/xml-data/build-dir/REACTOR-RAERON-AERON Command: /opt/jdk1.8.0_144/bin/java -Djava.security.manager=worker.org.gradle.process.internal.worker.child.BootstrapSecurityManager -Dfile.encoding=UTF-8 -Duser.country=US -Duser.language=en -Duser.variant -ea -cp /opt/users/bamboo/.gradle/caches/3.5/workerMain/gradle-worker.jar worker.org.gradle.process.internal.worker.GradleWorkerMain 'Gradle Test Executor 1'
22-Oct-2017 15:52:06 Successfully started process 'Gradle Test Executor 1'
22-Oct-2017 15:52:06 Initialized native services in: /opt/users/bamboo/.gradle/native
22-Oct-2017 15:52:06 Gradle Test Executor 1 started executing tests.
22-Oct-2017 15:52:06
22-Oct-2017 15:52:06 reactor.ipc.aeron.DriverManagerTest > test STANDARD_OUT
22-Oct-2017 15:52:06     15:52:06.894 [Test worker] DEBUG reactor.util.Loggers$LoggerFactory - Using Slf4j logging framework
22-Oct-2017 15:52:07     15:52:07.007 [Test worker] INFO  reactor.ipc.aeron.DriverManager - Embedded media driver initialized, aeronDirName: /dev/shm/aeron-bamboo-2cb747cd-d232-42b7-86c2-633fbea84f42
22-Oct-2017 15:52:07     0, Bytes sent
22-Oct-2017 15:52:07     1, Bytes received
22-Oct-2017 15:52:07     2, Failed offers to ReceiverProxy
22-Oct-2017 15:52:07     3, Failed offers to SenderProxy
22-Oct-2017 15:52:07     4, Failed offers to DriverConductorProxy
22-Oct-2017 15:52:07     5, NAKs sent
22-Oct-2017 15:52:07     6, NAKs received
22-Oct-2017 15:52:07     7, Status Messages sent
22-Oct-2017 15:52:07     8, Status Messages received
22-Oct-2017 15:52:07     9, Heartbeats sent
22-Oct-2017 15:52:07     10, Heartbeats received
22-Oct-2017 15:52:07     11, Retransmits sent
22-Oct-2017 15:52:07     12, Flow control under runs
22-Oct-2017 15:52:07     13, Flow control over runs
22-Oct-2017 15:52:07     14, Invalid packets
22-Oct-2017 15:52:07     15, Errors
22-Oct-2017 15:52:07     16, Short sends
22-Oct-2017 15:52:07     17, Client keep-alives
22-Oct-2017 15:52:07     18, Sender flow control limits applied
22-Oct-2017 15:52:07     19, Unblocked Publications
22-Oct-2017 15:52:07     20, Unblocked Control Commands
22-Oct-2017 15:52:07     21, Possible TTL Asymmetry
22-Oct-2017 15:52:07     22, ControllableIdleStrategy status
22-Oct-2017 15:52:07     23, Loss gap fills
22-Oct-2017 15:52:07     15:52:07.051 [Test worker] INFO  reactor.ipc.aeron.DriverManager - Embedded media driver shutdown initiated
22-Oct-2017 15:52:07     15:52:07.423 [single-1] INFO  reactor.ipc.aeron.DriverManager - Embedded media driver shutdown complete
22-Oct-2017 15:52:07
22-Oct-2017 15:52:07 reactor.ipc.aeron.AeronClientTest > testTwoClientsReceiveDataFromServer FAILED
22-Oct-2017 15:52:07     io.aeron.driver.exceptions.ConfigurationException: IPC publication term buffer length 67108864 greater than max length 131072
22-Oct-2017 15:52:07         at io.aeron.driver.MediaDriver$Context.conclude(MediaDriver.java:573)
22-Oct-2017 15:52:07         at io.aeron.driver.MediaDriver.<init>(MediaDriver.java:166)
22-Oct-2017 15:52:07         at io.aeron.driver.MediaDriver.launch(MediaDriver.java:275)
22-Oct-2017 15:52:07         at io.aeron.driver.MediaDriver.launchEmbedded(MediaDriver.java:254)
22-Oct-2017 15:52:07         at reactor.ipc.aeron.DriverManager.doInitialize(DriverManager.java:139)
22-Oct-2017 15:52:07         at reactor.ipc.aeron.DriverManager.access$100(DriverManager.java:39)
22-Oct-2017 15:52:07         at reactor.ipc.aeron.DriverManager$NotStartedState.launch(DriverManager.java:77)
22-Oct-2017 15:52:07         at reactor.ipc.aeron.DriverManager.launchDriver(DriverManager.java:131)
22-Oct-2017 15:52:07         at reactor.ipc.aeron.AeronWrapper.<init>(AeronWrapper.java:43)
22-Oct-2017 15:52:07         at reactor.ipc.aeron.server.ServerHandler.<init>(ServerHandler.java:76)
22-Oct-2017 15:52:07         at reactor.ipc.aeron.server.AeronServer.lambda$newHandler$1(AeronServer.java:63)
22-Oct-2017 15:52:07         at reactor.core.publisher.MonoCreate.subscribe(MonoCreate.java:53)
22-Oct-2017 15:52:07         at reactor.core.publisher.Mono.block(Mono.java:1184)
22-Oct-2017 15:52:07         at reactor.ipc.aeron.BaseAeronTest.blockAndAddDisposable(BaseAeronTest.java:22)
22-Oct-2017 15:52:07         at reactor.ipc.aeron.AeronClientTest.testTwoClientsReceiveDataFromServer(AeronClientTest.java:63)
22-Oct-2017 15:52:07
22-Oct-2017 15:52:07 reactor.ipc.aeron.AeronClientTest > testClientWith2HandlersReceiveData FAILED
22-Oct-2017 15:52:07     io.aeron.driver.exceptions.ConfigurationException: IPC publication term buffer length 67108864 greater than max length 131072
22-Oct-2017 15:52:07         at io.aeron.driver.MediaDriver$Context.conclude(MediaDriver.java:573)
22-Oct-2017 15:52:07         at io.aeron.driver.MediaDriver.<init>(MediaDriver.java:166)
22-Oct-2017 15:52:07         at io.aeron.driver.MediaDriver.launch(MediaDriver.java:275)
22-Oct-2017 15:52:07         at io.aeron.driver.MediaDriver.launchEmbedded(MediaDriver.java:254)
22-Oct-2017 15:52:07         at reactor.ipc.aeron.DriverManager.doInitialize(DriverManager.java:139)
22-Oct-2017 15:52:07         at reactor.ipc.aeron.DriverManager.access$100(DriverManager.java:39)
22-Oct-2017 15:52:07         at reactor.ipc.aeron.DriverManager$NotStartedState.launch(DriverManager.java:77)
22-Oct-2017 15:52:07         at reactor.ipc.aeron.DriverManager.launchDriver(DriverManager.java:131)
22-Oct-2017 15:52:07         at reactor.ipc.aeron.AeronWrapper.<init>(AeronWrapper.java:43)
22-Oct-2017 15:52:07         at reactor.ipc.aeron.server.ServerHandler.<init>(ServerHandler.java:76)
22-Oct-2017 15:52:07         at reactor.ipc.aeron.server.AeronServer.lambda$newHandler$1(AeronServer.java:63)
22-Oct-2017 15:52:07         at reactor.core.publisher.MonoCreate.subscribe(MonoCreate.java:53)
22-Oct-2017 15:52:07         at reactor.core.publisher.Mono.block(Mono.java:1184)
22-Oct-2017 15:52:07         at reactor.ipc.aeron.BaseAeronTest.blockAndAddDisposable(BaseAeronTest.java:22)
22-Oct-2017 15:52:07         at reactor.ipc.aeron.AeronClientTest.testClientWith2HandlersReceiveData(AeronClientTest.java:101)
22-Oct-2017 15:52:07
22-Oct-2017 15:52:07 reactor.ipc.aeron.AeronClientTest > testClientClosesSessionUponHeartbeatLoss FAILED
22-Oct-2017 15:52:07     io.aeron.driver.exceptions.ConfigurationException: IPC publication term buffer length 67108864 greater than max length 131072
22-Oct-2017 15:52:07         at io.aeron.driver.MediaDriver$Context.conclude(MediaDriver.java:573)
22-Oct-2017 15:52:07         at io.aeron.driver.MediaDriver.<init>(MediaDriver.java:166)
22-Oct-2017 15:52:07         at io.aeron.driver.MediaDriver.launch(MediaDriver.java:275)
22-Oct-2017 15:52:07         at io.aeron.driver.MediaDriver.launchEmbedded(MediaDriver.java:254)
22-Oct-2017 15:52:07         at reactor.ipc.aeron.DriverManager.doInitialize(DriverManager.java:139)
22-Oct-2017 15:52:07         at reactor.ipc.aeron.DriverManager.access$100(DriverManager.java:39)
22-Oct-2017 15:52:07         at reactor.ipc.aeron.DriverManager$NotStartedState.launch(DriverManager.java:77)
22-Oct-2017 15:52:07         at reactor.ipc.aeron.DriverManager.launchDriver(DriverManager.java:131)
22-Oct-2017 15:52:07         at reactor.ipc.aeron.AeronWrapper.<init>(AeronWrapper.java:43)
22-Oct-2017 15:52:07         at reactor.ipc.aeron.server.ServerHandler.<init>(ServerHandler.java:76)
22-Oct-2017 15:52:07         at reactor.ipc.aeron.server.AeronServer.lambda$newHandler$1(AeronServer.java:63)
22-Oct-2017 15:52:07         at reactor.core.publisher.MonoCreate.subscribe(MonoCreate.java:53)
22-Oct-2017 15:52:07         at reactor.core.publisher.Mono.block(Mono.java:1184)
22-Oct-2017 15:52:07         at reactor.ipc.aeron.AeronClientTest.testClientClosesSessionUponHeartbeatLoss(AeronClientTest.java:143)
22-Oct-2017 15:52:07
22-Oct-2017 15:52:07 reactor.ipc.aeron.AeronClientTest > testClientReceivesDataFromServer FAILED
22-Oct-2017 15:52:07     io.aeron.driver.exceptions.ConfigurationException: IPC publication term buffer length 67108864 greater than max length 131072
22-Oct-2017 15:52:07         at io.aeron.driver.MediaDriver$Context.conclude(MediaDriver.java:573)
22-Oct-2017 15:52:07         at io.aeron.driver.MediaDriver.<init>(MediaDriver.java:166)
22-Oct-2017 15:52:07         at io.aeron.driver.MediaDriver.launch(MediaDriver.java:275)
22-Oct-2017 15:52:07         at io.aeron.driver.MediaDriver.launchEmbedded(MediaDriver.java:254)
22-Oct-2017 15:52:07         at reactor.ipc.aeron.DriverManager.doInitialize(DriverManager.java:139)
22-Oct-2017 15:52:07         at reactor.ipc.aeron.DriverManager.access$100(DriverManager.java:39)
22-Oct-2017 15:52:07         at reactor.ipc.aeron.DriverManager$NotStartedState.launch(DriverManager.java:77)
22-Oct-2017 15:52:07         at reactor.ipc.aeron.DriverManager.launchDriver(DriverManager.java:131)
22-Oct-2017 15:52:07         at reactor.ipc.aeron.AeronWrapper.<init>(AeronWrapper.java:43)
22-Oct-2017 15:52:07         at reactor.ipc.aeron.server.ServerHandler.<init>(ServerHandler.java:76)
22-Oct-2017 15:52:07         at reactor.ipc.aeron.server.AeronServer.lambda$newHandler$1(AeronServer.java:63)
22-Oct-2017 15:52:07         at reactor.core.publisher.MonoCreate.subscribe(MonoCreate.java:53)
22-Oct-2017 15:52:07         at reactor.core.publisher.Mono.block(Mono.java:1184)
22-Oct-2017 15:52:07         at reactor.ipc.aeron.AeronClientTest.testClientReceivesDataFromServer(AeronClientTest.java:39)
22-Oct-2017 15:52:07
22-Oct-2017 15:52:07 reactor.ipc.aeron.WriteSequencerTest > itProvidesSignalsFromAddedPublishers STANDARD_OUT
22-Oct-2017 15:52:07     scheduler-A-3 - onNext: Hello
22-Oct-2017 15:52:07     scheduler-A-3 - onNext: world
22-Oct-2017 15:52:07     scheduler-A-3 - onComplete
22-Oct-2017 15:52:07     scheduler-B-4 - onNext: Everybody
22-Oct-2017 15:52:07     scheduler-B-4 - onNext: happy
22-Oct-2017 15:52:07     scheduler-B-4 - onComplete
22-Oct-2017 15:52:07
22-Oct-2017 15:52:07 reactor.ipc.aeron.AeronServerTest > testServerDisconnectsClientsUponShutdown FAILED
22-Oct-2017 15:52:07     io.aeron.driver.exceptions.ConfigurationException: IPC publication term buffer length 67108864 greater than max length 131072
22-Oct-2017 15:52:07         at io.aeron.driver.MediaDriver$Context.conclude(MediaDriver.java:573)
22-Oct-2017 15:52:07         at io.aeron.driver.MediaDriver.<init>(MediaDriver.java:166)
22-Oct-2017 15:52:07         at io.aeron.driver.MediaDriver.launch(MediaDriver.java:275)
22-Oct-2017 15:52:07         at io.aeron.driver.MediaDriver.launchEmbedded(MediaDriver.java:254)
22-Oct-2017 15:52:07         at reactor.ipc.aeron.DriverManager.doInitialize(DriverManager.java:139)
22-Oct-2017 15:52:07         at reactor.ipc.aeron.DriverManager.access$100(DriverManager.java:39)
22-Oct-2017 15:52:07         at reactor.ipc.aeron.DriverManager$NotStartedState.launch(DriverManager.java:77)
22-Oct-2017 15:52:07         at reactor.ipc.aeron.DriverManager.launchDriver(DriverManager.java:131)
22-Oct-2017 15:52:07         at reactor.ipc.aeron.AeronWrapper.<init>(AeronWrapper.java:43)
22-Oct-2017 15:52:07         at reactor.ipc.aeron.server.ServerHandler.<init>(ServerHandler.java:76)
22-Oct-2017 15:52:07         at reactor.ipc.aeron.server.AeronServer.lambda$newHandler$1(AeronServer.java:63)
22-Oct-2017 15:52:07         at reactor.core.publisher.MonoCreate.subscribe(MonoCreate.java:53)
22-Oct-2017 15:52:07         at reactor.core.publisher.Mono.block(Mono.java:1160)
22-Oct-2017 15:52:07         at reactor.ipc.aeron.AeronServerTest.testServerDisconnectsClientsUponShutdown(AeronServerTest.java:61)
22-Oct-2017 15:52:07
22-Oct-2017 15:52:07 reactor.ipc.aeron.AeronServerTest > testServerReceivesData FAILED
22-Oct-2017 15:52:07     io.aeron.driver.exceptions.ConfigurationException: IPC publication term buffer length 67108864 greater than max length 131072
22-Oct-2017 15:52:07         at io.aeron.driver.MediaDriver$Context.conclude(MediaDriver.java:573)
22-Oct-2017 15:52:07         at io.aeron.driver.MediaDriver.<init>(MediaDriver.java:166)
22-Oct-2017 15:52:07         at io.aeron.driver.MediaDriver.launch(MediaDriver.java:275)
22-Oct-2017 15:52:07         at io.aeron.driver.MediaDriver.launchEmbedded(MediaDriver.java:254)
22-Oct-2017 15:52:07         at reactor.ipc.aeron.DriverManager.doInitialize(DriverManager.java:139)
22-Oct-2017 15:52:07         at reactor.ipc.aeron.DriverManager.access$100(DriverManager.java:39)
22-Oct-2017 15:52:07         at reactor.ipc.aeron.DriverManager$NotStartedState.launch(DriverManager.java:77)
22-Oct-2017 15:52:07         at reactor.ipc.aeron.DriverManager.launchDriver(DriverManager.java:131)
22-Oct-2017 15:52:07         at reactor.ipc.aeron.AeronWrapper.<init>(AeronWrapper.java:43)
22-Oct-2017 15:52:07         at reactor.ipc.aeron.server.ServerHandler.<init>(ServerHandler.java:76)
22-Oct-2017 15:52:07         at reactor.ipc.aeron.server.AeronServer.lambda$newHandler$1(AeronServer.java:63)
22-Oct-2017 15:52:07         at reactor.core.publisher.MonoCreate.subscribe(MonoCreate.java:53)
22-Oct-2017 15:52:07         at reactor.core.publisher.Mono.block(Mono.java:1184)
22-Oct-2017 15:52:07         at reactor.ipc.aeron.AeronServerTest.testServerReceivesData(AeronServerTest.java:33)
22-Oct-2017 15:52:07
22-Oct-2017 15:52:07 reactor.ipc.aeron.AeronServerTest > testServerDisconnectsSessionUponHeartbeatLoss FAILED
22-Oct-2017 15:52:07     io.aeron.driver.exceptions.ConfigurationException: IPC publication term buffer length 67108864 greater than max length 131072
22-Oct-2017 15:52:07         at io.aeron.driver.MediaDriver$Context.conclude(MediaDriver.java:573)
22-Oct-2017 15:52:07         at io.aeron.driver.MediaDriver.<init>(MediaDriver.java:166)
22-Oct-2017 15:52:07         at io.aeron.driver.MediaDriver.launch(MediaDriver.java:275)
22-Oct-2017 15:52:07         at io.aeron.driver.MediaDriver.launchEmbedded(MediaDriver.java:254)
22-Oct-2017 15:52:07         at reactor.ipc.aeron.DriverManager.doInitialize(DriverManager.java:139)
22-Oct-2017 15:52:07         at reactor.ipc.aeron.DriverManager.access$100(DriverManager.java:39)
22-Oct-2017 15:52:07         at reactor.ipc.aeron.DriverManager$NotStartedState.launch(DriverManager.java:77)
22-Oct-2017 15:52:07         at reactor.ipc.aeron.DriverManager.launchDriver(DriverManager.java:131)
22-Oct-2017 15:52:07         at reactor.ipc.aeron.AeronWrapper.<init>(AeronWrapper.java:43)
22-Oct-2017 15:52:07         at reactor.ipc.aeron.server.ServerHandler.<init>(ServerHandler.java:76)
22-Oct-2017 15:52:07         at reactor.ipc.aeron.server.AeronServer.lambda$newHandler$1(AeronServer.java:63)
22-Oct-2017 15:52:07         at reactor.core.publisher.MonoCreate.subscribe(MonoCreate.java:53)
22-Oct-2017 15:52:07         at reactor.core.publisher.Mono.block(Mono.java:1160)
22-Oct-2017 15:52:07         at reactor.ipc.aeron.AeronServerTest.testServerDisconnectsSessionUponHeartbeatLoss(AeronServerTest.java:84)
22-Oct-2017 15:52:08 Gradle Test Executor 1 finished executing tests.
22-Oct-2017 15:52:08
22-Oct-2017 15:52:08 14 tests completed, 7 failed
22-Oct-2017 15:52:08 Finished generating test XML results (0.036 secs) into: /opt/bamboo-home/xml-data/build-dir/REACTOR-RAERON-AERON/build/test-results/test
22-Oct-2017 15:52:08 Generating HTML test report...
22-Oct-2017 15:52:08 Finished generating test html results (0.031 secs) into: /opt/bamboo-home/xml-data/build-dir/REACTOR-RAERON-AERON/build/reports/tests/test
22-Oct-2017 15:52:08 :test FAILED
22-Oct-2017 15:52:08 :test (Thread[Daemon worker,5,main]) completed. Took 2.938 secs.
22-Oct-2017 15:52:08
22-Oct-2017 15:52:08 FAILURE: Build failed with an exception.
22-Oct-2017 15:52:08
22-Oct-2017 15:52:08 * What went wrong:
22-Oct-2017 15:52:08 Execution failed for task ':test'.
22-Oct-2017 15:52:08 > There were failing tests. See the report at: file:///opt/bamboo-home/xml-data/build-dir/REACTOR-RAERON-AERON/build/reports/tests/test/index.html
22-Oct-2017 15:52:08
22-Oct-2017 15:52:08 * Try:
22-Oct-2017 15:52:08 Run with --debug option to get more log output.
22-Oct-2017 15:52:08
22-Oct-2017 15:52:08 * Exception is:
22-Oct-2017 15:52:08 org.gradle.api.tasks.TaskExecutionException: Execution failed for task ':test'.
22-Oct-2017 15:52:08         at org.gradle.api.internal.tasks.execution.ExecuteActionsTaskExecuter.executeActions(ExecuteActionsTaskExecuter.java:98)
22-Oct-2017 15:52:08         at org.gradle.api.internal.tasks.execution.ExecuteActionsTaskExecuter.execute(ExecuteActionsTaskExecuter.java:68)
22-Oct-2017 15:52:08         at org.gradle.api.internal.tasks.execution.SkipUpToDateTaskExecuter.execute(SkipUpToDateTaskExecuter.java:62)
22-Oct-2017 15:52:08         at org.gradle.api.internal.tasks.execution.ValidatingTaskExecuter.execute(ValidatingTaskExecuter.java:58)
22-Oct-2017 15:52:08         at org.gradle.api.internal.tasks.execution.SkipEmptySourceFilesTaskExecuter.execute(SkipEmptySourceFilesTaskExecuter.java:88)
22-Oct-2017 15:52:08         at org.gradle.api.internal.tasks.execution.ResolveTaskArtifactStateTaskExecuter.execute(ResolveTaskArtifactStateTaskExecuter.java:46)
22-Oct-2017 15:52:08         at org.gradle.api.internal.tasks.execution.SkipTaskWithNoActionsExecuter.execute(SkipTaskWithNoActionsExecuter.java:51)
22-Oct-2017 15:52:08         at org.gradle.api.internal.tasks.execution.SkipOnlyIfTaskExecuter.execute(SkipOnlyIfTaskExecuter.java:54)
22-Oct-2017 15:52:08         at org.gradle.api.internal.tasks.execution.ExecuteAtMostOnceTaskExecuter.execute(ExecuteAtMostOnceTaskExecuter.java:43)
22-Oct-2017 15:52:08         at org.gradle.api.internal.tasks.execution.CatchExceptionTaskExecuter.execute(CatchExceptionTaskExecuter.java:34)
22-Oct-2017 15:52:08         at org.gradle.execution.taskgraph.DefaultTaskGraphExecuter$EventFiringTaskWorker$1.execute(DefaultTaskGraphExecuter.java:236)
22-Oct-2017 15:52:08         at org.gradle.execution.taskgraph.DefaultTaskGraphExecuter$EventFiringTaskWorker$1.execute(DefaultTaskGraphExecuter.java:228)
22-Oct-2017 15:52:08         at org.gradle.internal.Transformers$4.transform(Transformers.java:169)
22-Oct-2017 15:52:08         at org.gradle.internal.progress.DefaultBuildOperationExecutor.run(DefaultBuildOperationExecutor.java:106)
22-Oct-2017 15:52:08         at org.gradle.internal.progress.DefaultBuildOperationExecutor.run(DefaultBuildOperationExecutor.java:61)
22-Oct-2017 15:52:08         at org.gradle.execution.taskgraph.DefaultTaskGraphExecuter$EventFiringTaskWorker.execute(DefaultTaskGraphExecuter.java:228)
22-Oct-2017 15:52:08         at org.gradle.execution.taskgraph.DefaultTaskGraphExecuter$EventFiringTaskWorker.execute(DefaultTaskGraphExecuter.java:215)
22-Oct-2017 15:52:08         at org.gradle.execution.taskgraph.AbstractTaskPlanExecutor$TaskExecutorWorker.processTask(AbstractTaskPlanExecutor.java:77)
22-Oct-2017 15:52:08         at org.gradle.execution.taskgraph.AbstractTaskPlanExecutor$TaskExecutorWorker.run(AbstractTaskPlanExecutor.java:58)
22-Oct-2017 15:52:08         at org.gradle.execution.taskgraph.DefaultTaskPlanExecutor.process(DefaultTaskPlanExecutor.java:32)
22-Oct-2017 15:52:08         at org.gradle.execution.taskgraph.DefaultTaskGraphExecuter.execute(DefaultTaskGraphExecuter.java:113)
22-Oct-2017 15:52:08         at org.gradle.execution.SelectedTaskExecutionAction.execute(SelectedTaskExecutionAction.java:37)
22-Oct-2017 15:52:08         at org.gradle.execution.DefaultBuildExecuter.execute(DefaultBuildExecuter.java:37)
22-Oct-2017 15:52:08         at org.gradle.execution.DefaultBuildExecuter.access$000(DefaultBuildExecuter.java:23)
22-Oct-2017 15:52:08         at org.gradle.execution.DefaultBuildExecuter$1.proceed(DefaultBuildExecuter.java:43)
22-Oct-2017 15:52:08         at org.gradle.execution.DryRunBuildExecutionAction.execute(DryRunBuildExecutionAction.java:32)
22-Oct-2017 15:52:08         at org.gradle.execution.DefaultBuildExecuter.execute(DefaultBuildExecuter.java:37)
22-Oct-2017 15:52:08         at org.gradle.execution.DefaultBuildExecuter.execute(DefaultBuildExecuter.java:30)
22-Oct-2017 15:52:08         at org.gradle.initialization.DefaultGradleLauncher$RunTasksAction.execute(DefaultGradleLauncher.java:230)
22-Oct-2017 15:52:08         at org.gradle.initialization.DefaultGradleLauncher$RunTasksAction.execute(DefaultGradleLauncher.java:227)
22-Oct-2017 15:52:08         at org.gradle.internal.Transformers$4.transform(Transformers.java:169)
22-Oct-2017 15:52:08         at org.gradle.internal.progress.DefaultBuildOperationExecutor.run(DefaultBuildOperationExecutor.java:106)
22-Oct-2017 15:52:08         at org.gradle.internal.progress.DefaultBuildOperationExecutor.run(DefaultBuildOperationExecutor.java:56)
22-Oct-2017 15:52:08         at org.gradle.initialization.DefaultGradleLauncher.doBuildStages(DefaultGradleLauncher.java:161)
22-Oct-2017 15:52:08         at org.gradle.initialization.DefaultGradleLauncher.doBuild(DefaultGradleLauncher.java:112)
22-Oct-2017 15:52:08         at org.gradle.initialization.DefaultGradleLauncher.run(DefaultGradleLauncher.java:95)
22-Oct-2017 15:52:08         at org.gradle.launcher.exec.GradleBuildController.run(GradleBuildController.java:66)
22-Oct-2017 15:52:08         at org.gradle.tooling.internal.provider.ExecuteBuildActionRunner.run(ExecuteBuildActionRunner.java:28)
22-Oct-2017 15:52:08         at org.gradle.launcher.exec.ChainingBuildActionRunner.run(ChainingBuildActionRunner.java:35)
22-Oct-2017 15:52:08         at org.gradle.launcher.exec.InProcessBuildActionExecuter.execute(InProcessBuildActionExecuter.java:41)
22-Oct-2017 15:52:08         at org.gradle.launcher.exec.InProcessBuildActionExecuter.execute(InProcessBuildActionExecuter.java:26)
22-Oct-2017 15:52:08         at org.gradle.tooling.internal.provider.ContinuousBuildActionExecuter.execute(ContinuousBuildActionExecuter.java:75)
22-Oct-2017 15:52:08         at org.gradle.tooling.internal.provider.ContinuousBuildActionExecuter.execute(ContinuousBuildActionExecuter.java:49)
22-Oct-2017 15:52:08         at org.gradle.tooling.internal.provider.ServicesSetupBuildActionExecuter.execute(ServicesSetupBuildActionExecuter.java:49)
22-Oct-2017 15:52:08         at org.gradle.tooling.internal.provider.ServicesSetupBuildActionExecuter.execute(ServicesSetupBuildActionExecuter.java:31)
22-Oct-2017 15:52:08         at org.gradle.launcher.daemon.server.exec.ExecuteBuild.doBuild(ExecuteBuild.java:67)
22-Oct-2017 15:52:08         at org.gradle.launcher.daemon.server.exec.BuildCommandOnly.execute(BuildCommandOnly.java:36)
22-Oct-2017 15:52:08         at org.gradle.launcher.daemon.server.api.DaemonCommandExecution.proceed(DaemonCommandExecution.java:120)
22-Oct-2017 15:52:08         at org.gradle.launcher.daemon.server.exec.WatchForDisconnection.execute(WatchForDisconnection.java:37)
22-Oct-2017 15:52:08         at org.gradle.launcher.daemon.server.api.DaemonCommandExecution.proceed(DaemonCommandExecution.java:120)
22-Oct-2017 15:52:08         at org.gradle.launcher.daemon.server.exec.ResetDeprecationLogger.execute(ResetDeprecationLogger.java:26)
22-Oct-2017 15:52:08         at org.gradle.launcher.daemon.server.api.DaemonCommandExecution.proceed(DaemonCommandExecution.java:120)
22-Oct-2017 15:52:08         at org.gradle.launcher.daemon.server.exec.RequestStopIfSingleUsedDaemon.execute(RequestStopIfSingleUsedDaemon.java:34)
22-Oct-2017 15:52:08         at org.gradle.launcher.daemon.server.api.DaemonCommandExecution.proceed(DaemonCommandExecution.java:120)
22-Oct-2017 15:52:08         at org.gradle.launcher.daemon.server.exec.ForwardClientInput$2.call(ForwardClientInput.java:74)
22-Oct-2017 15:52:08         at org.gradle.launcher.daemon.server.exec.ForwardClientInput$2.call(ForwardClientInput.java:72)
22-Oct-2017 15:52:08         at org.gradle.util.Swapper.swap(Swapper.java:38)
22-Oct-2017 15:52:08         at org.gradle.launcher.daemon.server.exec.ForwardClientInput.execute(ForwardClientInput.java:72)
22-Oct-2017 15:52:08         at org.gradle.launcher.daemon.server.api.DaemonCommandExecution.proceed(DaemonCommandExecution.java:120)
22-Oct-2017 15:52:08         at org.gradle.launcher.daemon.server.exec.LogAndCheckHealth.execute(LogAndCheckHealth.java:55)
22-Oct-2017 15:52:08         at org.gradle.launcher.daemon.server.api.DaemonCommandExecution.proceed(DaemonCommandExecution.java:120)
22-Oct-2017 15:52:08         at org.gradle.launcher.daemon.server.exec.LogToClient.doBuild(LogToClient.java:60)
22-Oct-2017 15:52:08         at org.gradle.launcher.daemon.server.exec.BuildCommandOnly.execute(BuildCommandOnly.java:36)
22-Oct-2017 15:52:08         at org.gradle.launcher.daemon.server.api.DaemonCommandExecution.proceed(DaemonCommandExecution.java:120)
22-Oct-2017 15:52:08         at org.gradle.launcher.daemon.server.exec.EstablishBuildEnvironment.doBuild(EstablishBuildEnvironment.java:72)
22-Oct-2017 15:52:08         at org.gradle.launcher.daemon.server.exec.BuildCommandOnly.execute(BuildCommandOnly.java:36)
22-Oct-2017 15:52:08         at org.gradle.launcher.daemon.server.api.DaemonCommandExecution.proceed(DaemonCommandExecution.java:120)
22-Oct-2017 15:52:08         at org.gradle.launcher.daemon.server.exec.StartBuildOrRespondWithBusy$1.run(StartBuildOrRespondWithBusy.java:50)
22-Oct-2017 15:52:08         at org.gradle.launcher.daemon.server.DaemonStateCoordinator$1.run(DaemonStateCoordinator.java:297)
22-Oct-2017 15:52:08         at org.gradle.internal.concurrent.ExecutorPolicy$CatchAndRecordFailures.onExecute(ExecutorPolicy.java:63)
22-Oct-2017 15:52:08         at org.gradle.internal.concurrent.StoppableExecutorImpl$1.run(StoppableExecutorImpl.java:46)
22-Oct-2017 15:52:08 Caused by: org.gradle.api.GradleException: There were failing tests. See the report at: file:///opt/bamboo-home/xml-data/build-dir/REACTOR-RAERON-AERON/build/reports/tests/test/index.html
22-Oct-2017 15:52:08         at org.gradle.api.tasks.testing.Test.handleTestFailures(Test.java:1304)
22-Oct-2017 15:52:08         at org.gradle.api.tasks.testing.Test.executeTests(Test.java:671)
22-Oct-2017 15:52:08         at org.gradle.internal.reflect.JavaMethod.invoke(JavaMethod.java:73)
22-Oct-2017 15:52:08         at org.gradle.api.internal.project.taskfactory.DefaultTaskClassInfoStore$StandardTaskAction.doExecute(DefaultTaskClassInfoStore.java:141)
22-Oct-2017 15:52:08         at org.gradle.api.internal.project.taskfactory.DefaultTaskClassInfoStore$StandardTaskAction.execute(DefaultTaskClassInfoStore.java:134)
22-Oct-2017 15:52:08         at org.gradle.api.internal.project.taskfactory.DefaultTaskClassInfoStore$StandardTaskAction.execute(DefaultTaskClassInfoStore.java:123)
22-Oct-2017 15:52:08         at org.gradle.api.internal.AbstractTask$TaskActionWrapper.execute(AbstractTask.java:692)
22-Oct-2017 15:52:08         at org.gradle.api.internal.AbstractTask$TaskActionWrapper.execute(AbstractTask.java:675)
22-Oct-2017 15:52:08         at org.gradle.api.internal.tasks.execution.ExecuteActionsTaskExecuter$1.execute(ExecuteActionsTaskExecuter.java:115)
22-Oct-2017 15:52:08         at org.gradle.api.internal.tasks.execution.ExecuteActionsTaskExecuter$1.execute(ExecuteActionsTaskExecuter.java:109)
22-Oct-2017 15:52:08         at org.gradle.internal.Transformers$4.transform(Transformers.java:169)
22-Oct-2017 15:52:08         at org.gradle.internal.progress.DefaultBuildOperationExecutor.run(DefaultBuildOperationExecutor.java:106)
22-Oct-2017 15:52:08         at org.gradle.internal.progress.DefaultBuildOperationExecutor.run(DefaultBuildOperationExecutor.java:56)
22-Oct-2017 15:52:08         at org.gradle.api.internal.tasks.execution.ExecuteActionsTaskExecuter.executeAction(ExecuteActionsTaskExecuter.java:109)
22-Oct-2017 15:52:08         at org.gradle.api.internal.tasks.execution.ExecuteActionsTaskExecuter.executeActions(ExecuteActionsTaskExecuter.java:90)
22-Oct-2017 15:52:08         ... 70 more
22-Oct-2017 15:52:08
22-Oct-2017 15:52:08
22-Oct-2017 15:52:08 BUILD FAILED
22-Oct-2017 15:52:08
22-Oct-2017 15:52:08 Total time: 31.765 secs
22-Oct-2017 15:52:08 Stopped 0 worker daemon(s).
22-Oct-2017 15:52:08 Received result Failure[value=org.gradle.initialization.ReportedException: org.gradle.internal.exceptions.LocationAwareException: Execution failed for task ':test'.] from daemon DaemonInfo{pid=20149, address=[4e37b6bf-edd1-449a-ae2c-7a5eb37bcf9a port:46204, addresses:[/0:0:0:0:0:0:0:1, /127.0.0.1]], state=Busy, lastBusy=1508687499314, context=DefaultDaemonContext[uid=7137994e-5708-43f8-9e5b-24761726af17,javaHome=/opt/jdk1.8.0_144,daemonRegistryDir=/opt/users/bamboo/.gradle/daemon,pid=20149,idleTimeout=10800000,daemonOpts=-XX:MaxPermSize=256m,-XX:+HeapDumpOnOutOfMemoryError,-Xmx1024m,-Dfile.encoding=UTF-8,-Duser.country=US,-Duser.language=en,-Duser.variant]} (build should be done).
22-Oct-2017 15:52:08
22-Oct-2017 15:52:08 Failing task since return code of [./gradlew --stacktrace --info clean test assemble -I /tmp/artifactory.init.script5470759177918777128gradle -DbuildInfoConfig.propertiesFile=/tmp/buildinfo7190716564757927131properties artifactoryPublish] was 1 while expected 0
22-Oct-2017 15:52:08 Finished task 'Build Test Assemble' with result: Failed
22-Oct-2017 15:52:08 Running post build plugin 'Docker Container Cleanup'
22-Oct-2017 15:52:08 Running post build plugin 'NCover Results Collector'
22-Oct-2017 15:52:08 Running post build plugin 'Artifactory Release Management Staging'
22-Oct-2017 15:52:08 Running post build plugin 'Artifactory Build Info Copier'
22-Oct-2017 15:52:08 Running post build plugin 'Artifactory Gradle Properties Info Copier'
22-Oct-2017 15:52:08 Running post build plugin 'Clover Results Collector'
22-Oct-2017 15:52:08 Running post build plugin 'npm Cache Cleanup'
22-Oct-2017 15:52:08 Running post build plugin 'Artifact Copier'
22-Oct-2017 15:52:08 Publishing an artifact: test-report
22-Oct-2017 15:52:08 Finished publishing of artifact Job artifact: [test-report], pattern: [**/build/reports/tests/**] in 21.49 ms
22-Oct-2017 15:52:08 Finalising the build...
22-Oct-2017 15:52:08 Stopping timer.
22-Oct-2017 15:52:08 Build REACTOR-RAERON-AERON-630 completed.
22-Oct-2017 15:52:08 Running on server: post build plugin 'NCover Results Collector'
22-Oct-2017 15:52:08 Running on server: post build plugin 'Build Hanging Detection Configuration'
22-Oct-2017 15:52:08 Running on server: post build plugin 'Clover Delta Calculator'
22-Oct-2017 15:52:08 Running on server: post build plugin 'Maven Dependencies Postprocessor'
22-Oct-2017 15:52:08 All post build plugins have finished
22-Oct-2017 15:52:08 Generating build results summary...
22-Oct-2017 15:52:08 Saving build results to disk...
22-Oct-2017 15:52:08 Logging substituted variables...
22-Oct-2017 15:52:08 Indexing build results...
22-Oct-2017 15:52:08 Finished building REACTOR-RAERON-AERON-630.