Build #300

Build: #300 failed

Job: RabbitMQ failed

Stages & jobs

  1. Default Stage

Build log

The build generated 768 lines of output. Download or view full build log

18-Jun-2019 08:13:28 Build Project Reactor - Reactor RabbitMQ - RabbitMQ #300 (REACTOR-REACTORRMQ-NETTY-300) started building on agent bamboo-16.af.pivotal.io
18-Jun-2019 08:13:28 Remote agent on host bamboo-16.af.pivotal.io
18-Jun-2019 08:13:28 Build working directory is /opt/bamboo-home/xml-data/build-dir/REACTOR-REACTORRMQ-NETTY
18-Jun-2019 08:13:28 Executing build Project Reactor - Reactor RabbitMQ - RabbitMQ #300 (REACTOR-REACTORRMQ-NETTY-300)
18-Jun-2019 08:13:28 Starting task 'Checkout' of type 'com.atlassian.bamboo.plugins.vcs:task.vcs.checkout'
18-Jun-2019 08:13:28 Build always requires a clean checkout
18-Jun-2019 08:13:28 Cleaning build directory '/opt/bamboo-home/xml-data/build-dir/REACTOR-REACTORRMQ-NETTY'
18-Jun-2019 08:13:28 Checking out into /opt/bamboo-home/xml-data/build-dir/REACTOR-REACTORRMQ-NETTY
18-Jun-2019 08:13:28 Updating source code to revision: ec1369bda4e4a056cc00e9da0a834c6bbd7ffd79
18-Jun-2019 08:13:28 Creating local git repository in '/opt/bamboo-home/xml-data/build-dir/REACTOR-REACTORRMQ-NETTY/.git'.
18-Jun-2019 08:13:28 Initialized empty Git repository in /opt/bamboo-home/xml-data/build-dir/REACTOR-REACTORRMQ-NETTY/.git/
18-Jun-2019 08:13:29 Fetching 'refs/heads/master' from 'https://github.com/reactor/reactor-rabbitmq.git'.
18-Jun-2019 08:13:32 From https://github.com/reactor/reactor-rabbitmq
18-Jun-2019 08:13:32 * [new branch]      master     -> master
18-Jun-2019 08:13:32 * [new tag]         v1.0.0.M1      -> v1.0.0.M1
18-Jun-2019 08:13:32 * [new tag]         v1.0.0.M2      -> v1.0.0.M2
18-Jun-2019 08:13:32 * [new tag]         v1.0.0.M3      -> v1.0.0.M3
18-Jun-2019 08:13:32 * [new tag]         v1.0.0.RC1     -> v1.0.0.RC1
18-Jun-2019 08:13:32 * [new tag]         v1.0.0.RC2     -> v1.0.0.RC2
18-Jun-2019 08:13:32 * [new tag]         v1.0.0.RELEASE -> v1.0.0.RELEASE
18-Jun-2019 08:13:32 * [new tag]         v1.1.0.RC1     -> v1.1.0.RC1
18-Jun-2019 08:13:32 * [new tag]         v1.1.0.RC2     -> v1.1.0.RC2
18-Jun-2019 08:13:32 * [new tag]         v1.1.0.RC3     -> v1.1.0.RC3
18-Jun-2019 08:13:32 * [new tag]         v1.1.0.RELEASE -> v1.1.0.RELEASE
18-Jun-2019 08:13:32 * [new tag]         v1.2.0.RC1     -> v1.2.0.RC1
18-Jun-2019 08:13:32 * [new tag]         v1.2.0.RC2     -> v1.2.0.RC2
18-Jun-2019 08:13:32 * [new tag]         v1.2.0.RELEASE -> v1.2.0.RELEASE
18-Jun-2019 08:13:32 * [new tag]         v1.3.0.M1      -> v1.3.0.M1
18-Jun-2019 08:13:32 Checking out revision ec1369bda4e4a056cc00e9da0a834c6bbd7ffd79.
18-Jun-2019 08:13:32 Already on 'master'
18-Jun-2019 08:13:32 Updated source code to revision: ec1369bda4e4a056cc00e9da0a834c6bbd7ffd79
18-Jun-2019 08:13:32 Finished task 'Checkout' with result: Success
18-Jun-2019 08:13:32 Running pre-build action: Artifactory Release Staging
18-Jun-2019 08:13:32 Running pre-build action: VCS Version Collector
18-Jun-2019 08:13:32 Starting task 'Build Test Assemble' of type 'org.jfrog.bamboo.bamboo-artifactory-plugin:artifactoryGradleTask'
18-Jun-2019 08:13:32 Bamboo Artifactory Plugin version: 2.6.3
18-Jun-2019 08:13:32
Beginning to execute external process for build 'Project Reactor - Reactor RabbitMQ - RabbitMQ #300 (REACTOR-REACTORRMQ-NETTY-300)'
... running command line:
./gradlew --stacktrace --no-daemon --info clean test assemble -I /tmp/artifactory.init.script2213363525060616795gradle -DbuildInfoConfig.propertiesFile=/tmp/buildinfo3222494120824442788properties artifactoryPublish -Dartifactory.resolve.password=******** -Dartifactory.publish.password=********
... in: /opt/bamboo-home/xml-data/build-dir/REACTOR-REACTORRMQ-NETTY
... using extra environment variables:
bamboo_planRepository_1_branch=master
bamboo_********_username_password=********
bamboo_signing_store_password=********
bamboo_capability_system_builder_ant_Ant_1_9=/opt/ant-1.9
bamboo_capability_system_builder_ant_Ant_1_8=/opt/ant-1.8
bamboo_planRepository_1_branchDisplayName=master
bamboo_artifactory_override_resolve_repo=libs-milestone
bamboo_capability_system_builder_node_Node_js_10_16=/opt/node-10.16/bin/node
bamboo_repository_revision_number=ec1369bda4e4a056cc00e9da0a834c6bbd7ffd79
bamboo_RIAK_BIN=/usr/sbin/riak
bamboo_repository_288522255_revision_number=ec1369bda4e4a056cc00e9da0a834c6bbd7ffd79
WRAPPER_BITS=32
bamboo_buildKey=REACTOR-REACTORRMQ-NETTY
bamboo_bintray_password=********
bamboo_sonar_token_password=********
PWD=/opt/bamboo-home/bin
bamboo_shortJobName=RabbitMQ
bamboo_artifactory_override_resolver_password=********
bamboo_sonatype_token=RSJChaox
bamboo_capability_system_builder_gradle___gradlew=./gradlew
bamboo_buildResultsUrl=https://build.spring.io/browse/REACTOR-REACTORRMQ-NETTY-300
bamboo_capability_system_builder_mvn3_Maven_3_3=/opt/maven-3.3
bamboo_capability_system_builder_mvn3_Maven_3_2=/opt/maven-3.2
bamboo_capability_system_builder_mvn3_Maven_3_1=/opt/maven-3.1
bamboo_planRepository_repositoryUrl=https://github.com/reactor/reactor-rabbitmq.git
bamboo_capability_system_builder_mvn3_Maven_3_6=/opt/maven-3.6
bamboo_agentId=286195719
bamboo_capability_system_builder_mvn3_Maven_3_5=/opt/maven-3.5
bamboo_capability_system_builder_mvn3_Maven_3_0=/opt/maven-3.0
bamboo_planRepository_revision=ec1369bda4e4a056cc00e9da0a834c6bbd7ffd79
bamboo_planRepository_previousRevision=b157671b2a3f71799ee69d5f0448e326929a0a1d
bamboo_capability_remote_build=true
bamboo_repository_branch_name=master
bamboo_sonatype_token_password=********
bamboo_sonatype_user=springsource
SHLVL=1
bamboo_repository_288522255_git_branch=master
bamboo_org_jfrog_bamboo_buildInfo_serverUrl=https://repo.spring.io
bamboo_repository_288522255_git_username=spring-buildmaster
bamboo_scdf_acceptance_tests_password=********
WRAPPER_OS=linux
JAVA_HOME=/opt/jdk-8/
TERM=linux
XDG_SESSION_ID=c1
bamboo_planRepository_branch=master
bamboo_org_jfrog_bamboo_release_activated=false
bamboo_repository_288522255_name=reactor-rabbitmq
bamboo_planRepository_1_type=gitv2
bamboo_planRepository_branchName=master
bamboo_capability_system_jdk_JDK_12=/opt/jdk-12
WRAPPER_FILE_SEPARATOR=/
_=/opt/bamboo-home/bin/bamboo-agent.sh
bamboo_capability_system_builder_ant_Ant_1_10=/opt/ant-1.10
bamboo_repository_288522255_git_repositoryUrl=https://github.com/reactor/reactor-rabbitmq.git
WRAPPER_PATH_SEPARATOR=:
bamboo_sonar_password=********
bamboo_hg_cache_directory=/opt/bamboo-home/xml-data/build-dir/_hg-repositories-cache
bamboo_planRepository_1_username=spring-buildmaster
bamboo_planRepository_type=gitv2
bamboo_git_cache_directory=/opt/bamboo-home/xml-data/build-dir/_git-repositories-cache
bamboo_repository_288522255_previous_revision_number=b157671b2a3f71799ee69d5f0448e326929a0a1d
bamboo_artifactory_username=buildmaster
bamboo_tmp_directory=/opt/bamboo-home/temp
bamboo_planKey=REACTOR-REACTORRMQ
bamboo_planRepository_username=spring-buildmaster
bamboo_JDK8_HOME=/opt/jdk-8
bamboo_planRepository_1_branchName=master
bamboo_sonar_version=5.6.3
bamboo_sonar_jdbc_password=********
bamboo_bintray_api_key_password=********
XDG_DATA_DIRS=/usr/local/share:/usr/share:/var/lib/snapd/desktop
bamboo_capability_system_jdk_JDK_1_11=/opt/jdk-11
bamboo_resultsUrl=https://build.spring.io/browse/REACTOR-REACTORRMQ-NETTY-300
bamboo_capability_system_jdk_JDK_1_10=/opt/jdk-10
bamboo_build_working_directory=/opt/bamboo-home/xml-data/build-dir/REACTOR-REACTORRMQ-NETTY
bamboo_planRepository_1_name=reactor-rabbitmq
bamboo_capability_system_os=ubuntu1804
bamboo_nexusPush_stagingProfile=buildmaster
bamboo_shortPlanName=Reactor RabbitMQ
MAIL=/var/mail/bamboo
bamboo_customGradle=
bamboo_planRepository_name=reactor-rabbitmq
LOGNAME=bamboo
bamboo_buildNumber=300
SHELL=/bin/bash
bamboo_planName=Project Reactor - Reactor RabbitMQ
bamboo_JDK7_HOME=/opt/jdk-7
bamboo_shortPlanKey=REACTORRMQ
OLDPWD=/opt/users/bamboo
bamboo_shortJobKey=NETTY
bamboo_artifactory_password=********
bamboo_buildTimeStamp=2019-06-18T08:13:28.567Z
bamboo_repository_previous_revision_number=b157671b2a3f71799ee69d5f0448e326929a0a1d
bamboo_sonar_username=buildmaster
bamboo_********_password=********
bamboo_repository_288522255_branch_name=master
bamboo_repository_git_branch=master
bamboo_buildResultKey=REACTOR-REACTORRMQ-NETTY-300
bamboo_nexusPush_close=true
bamboo_artifactory_override_resolver_username=buildmaster
bamboo_buildPlanName=Project Reactor - Reactor RabbitMQ - RabbitMQ
bamboo_planRepository_1_revision=ec1369bda4e4a056cc00e9da0a834c6bbd7ffd79
bamboo_repository_name=reactor-rabbitmq
bamboo_signing_key_password=********
bamboo_capability_system_builder_groovy_Groovy_2_5=/opt/groovy-2.5
LANG=en_US.UTF-8
bamboo_buildFailed=false
bamboo_capability_system_docker_executable=/usr/bin/docker
DISPLAY=localhost:1.0
bamboo_capability_system_jdk_OpenJDK_7=/opt/jdk-7
bamboo_capability_system_builder_groovy_Groovy_2_4=/opt/groovy-2.4
bamboo_artifactory_override_deployer_username=buildmaster
bamboo_artifactory_password_mask_b=********
bamboo_capability_system_builder_command_Bash=/bin/bash
bamboo_artifactory_password_mask_a=********
bamboo_agentWorkingDirectory=/opt/bamboo-home/xml-data/build-dir
bamboo_capability_system_git_executable=/usr/bin/git
bamboo_repository_git_username=spring-buildmaster
bamboo_planRepository_1_previousRevision=b157671b2a3f71799ee69d5f0448e326929a0a1d
bamboo_capability_os_family=unix
bamboo_planRepository_branchDisplayName=master
bamboo_capability_system_builder_maven_Artifactory_Maven_3_6=/opt/maven-3.6
bamboo_capability_system_builder_maven_Artifactory_Maven_3_5=/opt/maven-3.5
GIT_SSL_NO_VERIFY=true
bamboo_capability_system_builder_maven_Artifactory_Maven_3_3=/opt/maven-3.3
bamboo_capability_system_builder_maven_Artifactory_Maven_3_2=/opt/maven-3.2
bamboo_s3_properties=/home/bamboo/tools/s3.properties
bamboo_capability_system_builder_maven_Artifactory_Maven_3_1=/opt/maven-3.1
bamboo_artifactory_override_deploy_repo=libs-snapshot-local
bamboo_capability_system_builder_maven_Artifactory_Maven_3_0=/opt/maven-3.0
bamboo_plan_storageTag=plan-231768073
bamboo_bintray_username_password=********
USER=bamboo
bamboo_repository_git_repositoryUrl=https://github.com/reactor/reactor-rabbitmq.git
bamboo_working_directory=/opt/bamboo-home/xml-data/build-dir/REACTOR-REACTORRMQ-NETTY
bamboo_org_jfrog_bamboo_buildInfo_activated=true
bamboo_planRepository_1_repositoryUrl=https://github.com/reactor/reactor-rabbitmq.git
bamboo_capability_system_jdk_JDK_1_8=/opt/jdk-8
bamboo_artifactory_override_deployer_password=********
bamboo_capability_system_jdk_JDK_1_9=/opt/jdk-9
WRAPPER_ARCH=x86
bamboo_capability_system_jdk_JDK_1_6=/opt/jdk-6
bamboo_sonatype_password=********
bamboo_capability_system_jdk_JDK_1_7=/opt/jdk-7
bamboo_sonar_ip=10.194.6.9
XDG_RUNTIME_DIR=/run/user/1002
HOME=/home/bamboo
PATH=/bin:/home/bamboo/bin:/usr/local/sbin:/usr/local/bin:/usr/sbin:/usr/bin:/sbin:/bin:/usr/games:/usr/local/games:/snap/bin:/home/bamboo/bin:/usr/local/bin:/bin:/home/bamboo/bin:/usr/local/sbin:/usr/local/bin:/usr/sbin:/usr/bin:/sbin:/bin:/usr/games:/usr/local/games:/snap/bin:/home/bamboo/bin:/usr/local/bin
18-Jun-2019 08:13:32 Initialized native services in: /opt/users/bamboo/.gradle/native
18-Jun-2019 08:13:33 To honour the JVM settings for this build a new JVM will be forked. Please consider using the daemon: https://docs.gradle.org/5.4/userguide/gradle_daemon.html.
18-Jun-2019 08:13:33 Starting process 'Gradle build daemon'. Working directory: /opt/users/bamboo/.gradle/daemon/5.4 Command: /opt/jdk8u212-b03/bin/java -XX:MaxMetaspaceSize=256m -XX:+HeapDumpOnOutOfMemoryError -Xms256m -Xmx512m -Dfile.encoding=UTF-8 -Duser.country=US -Duser.language=en -Duser.variant -cp /home/bamboo/.gradle/wrapper/dists/gradle-5.4-bin/59btlbly62hzjka9h1c4c86kd/gradle-5.4/lib/gradle-launcher-5.4.jar org.gradle.launcher.daemon.bootstrap.GradleDaemon 5.4
18-Jun-2019 08:13:33 Successfully started process 'Gradle build daemon'
18-Jun-2019 08:13:33 An attempt to start the daemon took 0.787 secs.
18-Jun-2019 08:13:33 The client will now receive all logging from the daemon (pid: 16678). The daemon log file: /opt/users/bamboo/.gradle/daemon/5.4/daemon-16678.out.log
18-Jun-2019 08:13:33 Daemon will be stopped at the end of the build stopping after processing
18-Jun-2019 08:13:34 Using 4 worker leases.
18-Jun-2019 08:13:34 Starting Build
18-Jun-2019 08:13:35 Settings evaluated using settings file '/opt/bamboo-home/xml-data/build-dir/REACTOR-REACTORRMQ-NETTY/settings.gradle'.
18-Jun-2019 08:13:35 Projects loaded. Root project using build file '/opt/bamboo-home/xml-data/build-dir/REACTOR-REACTORRMQ-NETTY/build.gradle'.
18-Jun-2019 08:13:35 Included projects: [root project 'REACTOR-REACTORRMQ-NETTY', project ':reactor-rabbitmq-samples']
18-Jun-2019 08:13:37
18-Jun-2019 08:13:37 > Configure project :
18-Jun-2019 08:13:37 Evaluating root project 'REACTOR-REACTORRMQ-NETTY' using build file '/opt/bamboo-home/xml-data/build-dir/REACTOR-REACTORRMQ-NETTY/build.gradle'.
18-Jun-2019 08:13:37 Compiling build file '/opt/bamboo-home/xml-data/build-dir/REACTOR-REACTORRMQ-NETTY/build.gradle' using SubsetScriptTransformer.
18-Jun-2019 08:13:37 [Asciidoctor] asciidoctorj: 1.5.6
18-Jun-2019 08:13:37 [Asciidoctor] asciidoctorj-groovy-dsl: 1.0.0.Alpha2
18-Jun-2019 08:13:37 Compiling build file '/opt/bamboo-home/xml-data/build-dir/REACTOR-REACTORRMQ-NETTY/build.gradle' using BuildScriptTransformer.
18-Jun-2019 08:13:37
18-Jun-2019 08:13:37 > Configure project :reactor-rabbitmq-samples
18-Jun-2019 08:13:37 Evaluating project ':reactor-rabbitmq-samples' using build file '/opt/bamboo-home/xml-data/build-dir/REACTOR-REACTORRMQ-NETTY/reactor-rabbitmq-samples/build.gradle'.
18-Jun-2019 08:13:37 All projects evaluated.
18-Jun-2019 08:13:37 No publish configurations specified for project ':' - using the default 'archives' configuration.
18-Jun-2019 08:13:37 No publish configurations specified for project ':reactor-rabbitmq-samples' - using the default 'archives' configuration.
18-Jun-2019 08:13:37 Selected primary task 'clean' from project :
18-Jun-2019 08:13:37 Selected primary task 'test' from project :
18-Jun-2019 08:13:37 Selected primary task 'assemble' from project :
18-Jun-2019 08:13:37 Selected primary task 'artifactoryPublish' from project :
18-Jun-2019 08:13:37 Tasks to be executed: [task ':clean', task ':reactor-rabbitmq-samples:clean', task ':compileJava', task ':processResources', task ':classes', task ':compileTestJava', task ':processTestResources', task ':testClasses', task ':test', task ':jar', task ':reactor-rabbitmq-samples:compileJava', task ':reactor-rabbitmq-samples:processResources', task ':reactor-rabbitmq-samples:classes', task ':reactor-rabbitmq-samples:compileTestJava', task ':reactor-rabbitmq-samples:processTestResources', task ':reactor-rabbitmq-samples:testClasses', task ':reactor-rabbitmq-samples:test', task ':asciidoctor', task ':docsZip', task ':javadoc', task ':javadocJar', task ':sourcesJar', task ':assemble', task ':reactor-rabbitmq-samples:jar', task ':reactor-rabbitmq-samples:javadoc', task ':reactor-rabbitmq-samples:javadocJar', task ':reactor-rabbitmq-samples:sourcesJar', task ':reactor-rabbitmq-samples:assemble', task ':install', task ':uploadArchives', task ':reactor-rabbitmq-samples:install', task ':reactor-rabbitmq-samples:uploadArchives', task ':reactor-rabbitmq-samples:artifactoryPublish', task ':artifactoryPublish', task ':artifactoryDeploy']
18-Jun-2019 08:13:37 :clean (Thread[Execution worker for ':',5,main]) started.
18-Jun-2019 08:13:37
18-Jun-2019 08:13:37 > Task :clean UP-TO-DATE
18-Jun-2019 08:13:37 Caching disabled for task ':clean' because:
18-Jun-2019 08:13:37   Build cache is disabled
18-Jun-2019 08:13:37 Task ':clean' is not up-to-date because:
18-Jun-2019 08:13:37   Task has not declared any outputs despite executing actions.
18-Jun-2019 08:13:37 :clean (Thread[Execution worker for ':',5,main]) completed. Took 0.041 secs.
18-Jun-2019 08:13:37 :reactor-rabbitmq-samples:clean (Thread[Execution worker for ':' Thread 2,5,main]) started.
18-Jun-2019 08:13:37
18-Jun-2019 08:13:37 > Task :reactor-rabbitmq-samples:clean UP-TO-DATE
18-Jun-2019 08:13:37 Caching disabled for task ':reactor-rabbitmq-samples:clean' because:
18-Jun-2019 08:13:37   Build cache is disabled
18-Jun-2019 08:13:37 Task ':reactor-rabbitmq-samples:clean' is not up-to-date because:
18-Jun-2019 08:13:37   Task has not declared any outputs despite executing actions.
18-Jun-2019 08:13:37 :reactor-rabbitmq-samples:clean (Thread[Execution worker for ':' Thread 2,5,main]) completed. Took 0.005 secs.
18-Jun-2019 08:13:37 :compileJava (Thread[Execution worker for ':' Thread 2,5,main]) started.
18-Jun-2019 08:13:39
18-Jun-2019 08:13:39 > Task :compileJava
18-Jun-2019 08:13:39 Cached resource https://repo.spring.io/libs-snapshot/io/projectreactor/reactor-core/3.3.0.BUILD-SNAPSHOT/maven-metadata.xml is up-to-date (lastModified: Fri Jun 14 20:53:09 UTC 2019).
18-Jun-2019 08:13:39 Found locally available resource with matching checksum: [https://repo.spring.io/libs-release/com/rabbitmq/amqp-client/5.7.1/amqp-client-5.7.1.pom, /opt/users/bamboo/.gradle/caches/modules-2/files-2.1/com.rabbitmq/amqp-client/5.7.1/8cbb3d6d73c3a3cfbc585d481945e640270ae81f/amqp-client-5.7.1.pom]
18-Jun-2019 08:13:39 Cached resource https://repo.spring.io/libs-snapshot/io/projectreactor/reactor-core/3.3.0.BUILD-SNAPSHOT/reactor-core-3.3.0.BUILD-20190614.204559-90.pom is up-to-date (lastModified: Fri Jun 14 20:53:09 UTC 2019).
18-Jun-2019 08:13:39 Cached resource https://repo.spring.io/libs-snapshot/io/projectreactor/reactor-core/3.3.0.BUILD-SNAPSHOT/reactor-core-3.3.0.BUILD-20190614.204559-90.jar is up-to-date (lastModified: Fri Jun 14 20:53:08 UTC 2019).
18-Jun-2019 08:13:39 Found locally available resource with matching checksum: [https://repo.spring.io/libs-release/com/rabbitmq/amqp-client/5.7.1/amqp-client-5.7.1.jar, /opt/users/bamboo/.gradle/caches/modules-2/files-2.1/com.rabbitmq/amqp-client/5.7.1/747f54e5a70dfc5037a5695c0611dbfa72fe410c/amqp-client-5.7.1.jar]
18-Jun-2019 08:13:39 Caching disabled for task ':compileJava' because:
18-Jun-2019 08:13:39   Build cache is disabled
18-Jun-2019 08:13:39 Task ':compileJava' is not up-to-date because:
18-Jun-2019 08:13:39   No history is available.
18-Jun-2019 08:13:39 All input files are considered out-of-date for incremental task ':compileJava'.
18-Jun-2019 08:13:39 Full recompilation is required because no incremental change information is available. This is usually caused by clean builds or changing compiler arguments.
18-Jun-2019 08:13:39 Compiling with JDK Java compiler API.
18-Jun-2019 08:13:39 Created classpath snapshot for incremental compilation in 0.216 secs.
18-Jun-2019 08:13:39 :compileJava (Thread[Execution worker for ':' Thread 2,5,main]) completed. Took 2.057 secs.
18-Jun-2019 08:13:39 :processResources (Thread[Execution worker for ':' Thread 2,5,main]) started.
18-Jun-2019 08:13:39
18-Jun-2019 08:13:39 > Task :processResources NO-SOURCE
18-Jun-2019 08:13:39 file or directory '/opt/bamboo-home/xml-data/build-dir/REACTOR-REACTORRMQ-NETTY/src/main/resources', not found
18-Jun-2019 08:13:39 Skipping task ':processResources' as it has no source files and no previous output files.
18-Jun-2019 08:13:39 :processResources (Thread[Execution worker for ':' Thread 2,5,main]) completed. Took 0.003 secs.
18-Jun-2019 08:13:39 :classes (Thread[Execution worker for ':' Thread 3,5,main]) started.
18-Jun-2019 08:13:39
18-Jun-2019 08:13:39 > Task :classes
18-Jun-2019 08:13:39 Skipping task ':classes' as it has no actions.
18-Jun-2019 08:13:39 :classes (Thread[Execution worker for ':' Thread 3,5,main]) completed. Took 0.0 secs.
18-Jun-2019 08:13:39 :compileTestJava (Thread[Execution worker for ':' Thread 3,5,main]) started.
18-Jun-2019 08:13:41
18-Jun-2019 08:13:41 > Task :compileTestJava
18-Jun-2019 08:13:41 Found locally available resource with matching checksum: [https://repo.spring.io/libs-release/org/junit/jupiter/junit-jupiter-params/5.4.2/junit-jupiter-params-5.4.2.pom, /home/bamboo/.m2/repository/org/junit/jupiter/junit-jupiter-params/5.4.2/junit-jupiter-params-5.4.2.pom]
18-Jun-2019 08:13:41 Found locally available resource with matching checksum: [https://repo.spring.io/libs-release/org/mockito/mockito-core/2.28.2/mockito-core-2.28.2.pom, /home/bamboo/.m2/repository/org/mockito/mockito-core/2.28.2/mockito-core-2.28.2.pom]
18-Jun-2019 08:13:41 Cached resource https://repo.spring.io/libs-snapshot/io/projectreactor/reactor-test/3.3.0.BUILD-SNAPSHOT/maven-metadata.xml is up-to-date (lastModified: Fri Jun 14 20:53:11 UTC 2019).
18-Jun-2019 08:13:41 Found locally available resource with matching checksum: [https://repo.spring.io/libs-release/org/junit/jupiter/junit-jupiter-api/5.4.2/junit-jupiter-api-5.4.2.pom, /opt/users/bamboo/.gradle/caches/modules-2/files-2.1/org.junit.jupiter/junit-jupiter-api/5.4.2/7a5c242eaaa14f2932c0943bf21f3991d5ee52ae/junit-jupiter-api-5.4.2.pom]
18-Jun-2019 08:13:41 Cached resource https://repo.spring.io/libs-snapshot/io/projectreactor/reactor-test/3.3.0.BUILD-SNAPSHOT/reactor-test-3.3.0.BUILD-20190614.204559-90.pom is up-to-date (lastModified: Fri Jun 14 20:53:11 UTC 2019).
18-Jun-2019 08:13:41 Found locally available resource with matching checksum: [https://repo.spring.io/libs-release/org/junit/platform/junit-platform-commons/1.4.2/junit-platform-commons-1.4.2.pom, /opt/users/bamboo/.gradle/caches/modules-2/files-2.1/org.junit.platform/junit-platform-commons/1.4.2/f85012e8320fa84036418520b37ad37913ef95db/junit-platform-commons-1.4.2.pom]
18-Jun-2019 08:13:41 Found locally available resource with matching checksum: [https://repo.spring.io/libs-release/net/bytebuddy/byte-buddy/1.9.10/byte-buddy-1.9.10.pom, /opt/users/bamboo/.gradle/caches/modules-2/files-2.1/net.bytebuddy/byte-buddy/1.9.10/30e93444089cf78a839290ea30ef36fa892e045d/byte-buddy-1.9.10.pom]
18-Jun-2019 08:13:41 Found locally available resource with matching checksum: [https://repo.spring.io/libs-release/net/bytebuddy/byte-buddy-agent/1.9.10/byte-buddy-agent-1.9.10.pom, /opt/users/bamboo/.gradle/caches/modules-2/files-2.1/net.bytebuddy/byte-buddy-agent/1.9.10/856c025dc43c6c68ca5ae431ca2d77b5951b9c09/byte-buddy-agent-1.9.10.pom]
18-Jun-2019 08:13:41 Found locally available resource with matching checksum: [https://repo.spring.io/libs-release/net/bytebuddy/byte-buddy-parent/1.9.10/byte-buddy-parent-1.9.10.pom, /opt/users/bamboo/.gradle/caches/modules-2/files-2.1/net.bytebuddy/byte-buddy-parent/1.9.10/adb368c4cca2acbc8d18380b065f6b5bba0f7b24/byte-buddy-parent-1.9.10.pom]
18-Jun-2019 08:13:41 Found locally available resource with matching checksum: [https://repo.spring.io/libs-release/org/junit/jupiter/junit-jupiter-api/5.4.2/junit-jupiter-api-5.4.2.jar, /opt/users/bamboo/.gradle/caches/modules-2/files-2.1/org.junit.jupiter/junit-jupiter-api/5.4.2/665d1c0daecb26c6210c872768000b417e7e52b6/junit-jupiter-api-5.4.2.jar]
18-Jun-2019 08:13:41 Found locally available resource with matching checksum: [https://repo.spring.io/libs-release/org/junit/jupiter/junit-jupiter-params/5.4.2/junit-jupiter-params-5.4.2.jar, /home/bamboo/.m2/repository/org/junit/jupiter/junit-jupiter-params/5.4.2/junit-jupiter-params-5.4.2.jar]
18-Jun-2019 08:13:41 Cached resource https://repo.spring.io/libs-snapshot/io/projectreactor/reactor-test/3.3.0.BUILD-SNAPSHOT/reactor-test-3.3.0.BUILD-20190614.204559-90.jar is up-to-date (lastModified: Fri Jun 14 20:53:11 UTC 2019).
18-Jun-2019 08:13:41 Found locally available resource with matching checksum: [https://repo.spring.io/libs-release/org/mockito/mockito-core/2.28.2/mockito-core-2.28.2.jar, /home/bamboo/.m2/repository/org/mockito/mockito-core/2.28.2/mockito-core-2.28.2.jar]
18-Jun-2019 08:13:41 Found locally available resource with matching checksum: [https://repo.spring.io/libs-release/org/junit/platform/junit-platform-commons/1.4.2/junit-platform-commons-1.4.2.jar, /opt/users/bamboo/.gradle/caches/modules-2/files-2.1/org.junit.platform/junit-platform-commons/1.4.2/37993dc807ca253aa347be8968a0ae7b70642dbc/junit-platform-commons-1.4.2.jar]
18-Jun-2019 08:13:41 Found locally available resource with matching checksum: [https://repo.spring.io/libs-release/net/bytebuddy/byte-buddy-agent/1.9.10/byte-buddy-agent-1.9.10.jar, /opt/users/bamboo/.gradle/caches/modules-2/files-2.1/net.bytebuddy/byte-buddy-agent/1.9.10/9674aba5ee793e54b864952b001166848da0f26b/byte-buddy-agent-1.9.10.jar]
18-Jun-2019 08:13:41 Found locally available resource with matching checksum: [https://repo.spring.io/libs-release/net/bytebuddy/byte-buddy/1.9.10/byte-buddy-1.9.10.jar, /opt/users/bamboo/.gradle/caches/modules-2/files-2.1/net.bytebuddy/byte-buddy/1.9.10/211a2b4d3df1eeef2a6cacf78d74a1f725e7a840/byte-buddy-1.9.10.jar]
18-Jun-2019 08:13:41 Caching disabled for task ':compileTestJava' because:
18-Jun-2019 08:13:41   Build cache is disabled
18-Jun-2019 08:13:41 Task ':compileTestJava' is not up-to-date because:
18-Jun-2019 08:13:41   No history is available.
18-Jun-2019 08:13:41 All input files are considered out-of-date for incremental task ':compileTestJava'.
18-Jun-2019 08:13:41 Full recompilation is required because no incremental change information is available. This is usually caused by clean builds or changing compiler arguments.
18-Jun-2019 08:13:41 Compiling with JDK Java compiler API.
18-Jun-2019 08:13:41 Created classpath snapshot for incremental compilation in 0.714 secs. 1 duplicate classes found in classpath (see all with --debug).
18-Jun-2019 08:13:41 :compileTestJava (Thread[Execution worker for ':' Thread 3,5,main]) completed. Took 2.12 secs.
18-Jun-2019 08:13:41 :processTestResources (Thread[Execution worker for ':',5,main]) started.
18-Jun-2019 08:13:41
18-Jun-2019 08:13:41 > Task :processTestResources
18-Jun-2019 08:13:41 Caching disabled for task ':processTestResources' because:
18-Jun-2019 08:13:41   Build cache is disabled
18-Jun-2019 08:13:41 Task ':processTestResources' is not up-to-date because:
18-Jun-2019 08:13:41   No history is available.
18-Jun-2019 08:13:41 :processTestResources (Thread[Execution worker for ':',5,main]) completed. Took 0.011 secs.
18-Jun-2019 08:13:41 :testClasses (Thread[Execution worker for ':' Thread 3,5,main]) started.
18-Jun-2019 08:13:41
18-Jun-2019 08:13:41 > Task :testClasses
18-Jun-2019 08:13:41 Skipping task ':testClasses' as it has no actions.
18-Jun-2019 08:13:41 :testClasses (Thread[Execution worker for ':' Thread 3,5,main]) completed. Took 0.0 secs.
18-Jun-2019 08:13:41 :test (Thread[Execution worker for ':' Thread 3,5,main]) started.
18-Jun-2019 08:13:42 Gradle Test Executor 1 started executing tests.
18-Jun-2019 08:13:43
18-Jun-2019 08:13:43 > Task :test
18-Jun-2019 08:13:43 Found locally available resource with matching checksum: [https://repo.spring.io/libs-release/org/junit/jupiter/junit-jupiter-engine/5.4.2/junit-jupiter-engine-5.4.2.pom, /home/bamboo/.m2/repository/org/junit/jupiter/junit-jupiter-engine/5.4.2/junit-jupiter-engine-5.4.2.pom]
18-Jun-2019 08:13:43 Found locally available resource with matching checksum: [https://repo.spring.io/libs-release/org/junit/platform/junit-platform-engine/1.4.2/junit-platform-engine-1.4.2.pom, /home/bamboo/.m2/repository/org/junit/platform/junit-platform-engine/1.4.2/junit-platform-engine-1.4.2.pom]
18-Jun-2019 08:13:43 Found locally available resource with matching checksum: [https://repo.spring.io/libs-release/org/junit/platform/junit-platform-engine/1.4.2/junit-platform-engine-1.4.2.jar, /home/bamboo/.m2/repository/org/junit/platform/junit-platform-engine/1.4.2/junit-platform-engine-1.4.2.jar]
18-Jun-2019 08:13:43 Found locally available resource with matching checksum: [https://repo.spring.io/libs-release/org/junit/jupiter/junit-jupiter-engine/5.4.2/junit-jupiter-engine-5.4.2.jar, /home/bamboo/.m2/repository/org/junit/jupiter/junit-jupiter-engine/5.4.2/junit-jupiter-engine-5.4.2.jar]
18-Jun-2019 08:13:43 Caching disabled for task ':test' because:
18-Jun-2019 08:13:43   Build cache is disabled
18-Jun-2019 08:13:43 Task ':test' is not up-to-date because:
18-Jun-2019 08:13:43   Task.upToDateWhen is false.
18-Jun-2019 08:13:43 Starting process 'Gradle Test Executor 1'. Working directory: /opt/bamboo-home/xml-data/build-dir/REACTOR-REACTORRMQ-NETTY Command: /opt/jdk8u212-b03/bin/java -Djava.security.manager=worker.org.gradle.process.internal.worker.child.BootstrapSecurityManager -Dorg.gradle.native=false -Drabbitmqctl.bin=sudo rabbitmqctl -Xmx512m -Dfile.encoding=UTF-8 -Duser.country=US -Duser.language=en -Duser.variant -ea -cp /opt/users/bamboo/.gradle/caches/5.4/workerMain/gradle-worker.jar worker.org.gradle.process.internal.worker.GradleWorkerMain 'Gradle Test Executor 1'
18-Jun-2019 08:13:43 Successfully started process 'Gradle Test Executor 1'
18-Jun-2019 08:14:05
18-Jun-2019 08:14:05 reactor.rabbitmq.RabbitFluxTests > senderCloseIsIdempotent() STANDARD_OUT
18-Jun-2019 08:14:05     08:14:05.778 [rabbitmq-sender-connection-subscription-50] WARN  r.r.ChannelCloseHandlers$SenderChannelCloseHandler - Channel 1 didn't close normally: clean connection shutdown; protocol method: #method<connection.close>(reply-code=200, reply-text=OK, class-id=0, method-id=0)
18-Jun-2019 08:14:06
18-Jun-2019 08:14:06 reactor.rabbitmq.RabbitFluxTests > publishConfirmsErrorWhilePublishing() STANDARD_OUT
18-Jun-2019 08:14:06     08:14:06.757 [rabbitmq-sender-connection-subscription-99] ERROR reactor.rabbitmq.Sender - error in publish confirm sending
18-Jun-2019 08:14:06     reactor.rabbitmq.RabbitFluxException: java.io.IOException: simulated error while publishing
18-Jun-2019 08:14:06             at reactor.rabbitmq.RabbitFluxTests.lambda$publishConfirmsErrorWhilePublishing$46(RabbitFluxTests.java:835)
18-Jun-2019 08:14:06             at reactor.rabbitmq.Sender$PublishConfirmSubscriber.onNext(Sender.java:631)
18-Jun-2019 08:14:06             at reactor.rabbitmq.Sender$PublishConfirmSubscriber.onNext(Sender.java:526)
18-Jun-2019 08:14:06             at reactor.core.publisher.FluxMapFuseable$MapFuseableSubscriber.onNext(FluxMapFuseable.java:121)
18-Jun-2019 08:14:06             at reactor.core.publisher.FluxRange$RangeSubscription.fastPath(FluxRange.java:129)
18-Jun-2019 08:14:06             at reactor.core.publisher.FluxRange$RangeSubscription.request(FluxRange.java:107)
18-Jun-2019 08:14:06             at reactor.core.publisher.FluxMapFuseable$MapFuseableSubscriber.request(FluxMapFuseable.java:162)
18-Jun-2019 08:14:06             at reactor.rabbitmq.Sender$PublishConfirmSubscriber.request(Sender.java:551)
18-Jun-2019 08:14:06             at reactor.core.publisher.FluxDoFinally$DoFinallySubscriber.request(FluxDoFinally.java:150)
18-Jun-2019 08:14:06             at reactor.core.publisher.MonoFlatMapMany$FlatMapManyMain.onSubscribeInner(MonoFlatMapMany.java:140)
18-Jun-2019 08:14:06             at reactor.core.publisher.MonoFlatMapMany$FlatMapManyInner.onSubscribe(MonoFlatMapMany.java:233)
18-Jun-2019 08:14:06             at reactor.core.publisher.FluxDoFinally$DoFinallySubscriber.onSubscribe(FluxDoFinally.java:117)
18-Jun-2019 08:14:06             at reactor.rabbitmq.Sender$PublishConfirmSubscriber.onSubscribe(Sender.java:609)
18-Jun-2019 08:14:06             at reactor.core.publisher.FluxMapFuseable$MapFuseableSubscriber.onSubscribe(FluxMapFuseable.java:90)
18-Jun-2019 08:14:06             at reactor.core.publisher.FluxRange.subscribe(FluxRange.java:68)
18-Jun-2019 08:14:06             at reactor.core.publisher.FluxMapFuseable.subscribe(FluxMapFuseable.java:63)
18-Jun-2019 08:14:06             at reactor.rabbitmq.Sender$PublishConfirmOperator.subscribe(Sender.java:522)
18-Jun-2019 08:14:06             at reactor.core.publisher.FluxDoFinally.subscribe(FluxDoFinally.java:73)
18-Jun-2019 08:14:06             at reactor.core.publisher.Flux.subscribe(Flux.java:7922)
18-Jun-2019 08:14:06             at reactor.core.publisher.MonoFlatMapMany$FlatMapManyMain.onNext(MonoFlatMapMany.java:184)
18-Jun-2019 08:14:06             at reactor.core.publisher.FluxMap$MapSubscriber.onNext(FluxMap.java:114)
18-Jun-2019 08:14:06             at reactor.core.publisher.FluxMap$MapSubscriber.onNext(FluxMap.java:114)
18-Jun-2019 08:14:06             at reactor.core.publisher.Operators$MonoSubscriber.complete(Operators.java:1575)
18-Jun-2019 08:14:06             at reactor.core.publisher.MonoProcessor.onNext(MonoProcessor.java:316)
18-Jun-2019 08:14:06             at reactor.core.publisher.MonoSubscribeOn$SubscribeOnSubscriber.onNext(MonoSubscribeOn.java:143)
18-Jun-2019 08:14:06             at reactor.core.publisher.FluxPeekFuseable$PeekFuseableSubscriber.onNext(FluxPeekFuseable.java:204)
18-Jun-2019 08:14:06             at reactor.core.publisher.Operators$MonoSubscriber.complete(Operators.java:1575)
18-Jun-2019 08:14:06             at reactor.core.publisher.MonoCallable.subscribe(MonoCallable.java:61)
18-Jun-2019 08:14:06             at reactor.core.publisher.MonoPeekFuseable.subscribe(MonoPeekFuseable.java:74)
18-Jun-2019 08:14:06             at reactor.core.publisher.Mono.subscribe(Mono.java:3850)
18-Jun-2019 08:14:06             at reactor.core.publisher.MonoSubscribeOn$SubscribeOnSubscriber.run(MonoSubscribeOn.java:123)
18-Jun-2019 08:14:06             at reactor.core.scheduler.WorkerTask.call(WorkerTask.java:84)
18-Jun-2019 08:14:06             at reactor.core.scheduler.WorkerTask.call(WorkerTask.java:37)
18-Jun-2019 08:14:06             at java.util.concurrent.FutureTask.run(FutureTask.java:266)
18-Jun-2019 08:14:06             at java.util.concurrent.ScheduledThreadPoolExecutor$ScheduledFutureTask.access$201(ScheduledThreadPoolExecutor.java:180)
18-Jun-2019 08:14:06             at java.util.concurrent.ScheduledThreadPoolExecutor$ScheduledFutureTask.run(ScheduledThreadPoolExecutor.java:293)
18-Jun-2019 08:14:06             at java.util.concurrent.ThreadPoolExecutor.runWorker(ThreadPoolExecutor.java:1149)
18-Jun-2019 08:14:06             at java.util.concurrent.ThreadPoolExecutor$Worker.run(ThreadPoolExecutor.java:624)
18-Jun-2019 08:14:06             at java.lang.Thread.run(Thread.java:748)
18-Jun-2019 08:14:06     Caused by: java.io.IOException: simulated error while publishing
18-Jun-2019 08:14:06             at reactor.rabbitmq.RabbitFluxTests.lambda$publishConfirmsErrorWhilePublishing$44(RabbitFluxTests.java:824)
18-Jun-2019 08:14:06             at org.mockito.internal.stubbing.StubbedInvocationMatcher.answer(StubbedInvocationMatcher.java:39)
18-Jun-2019 08:14:06             at org.mockito.internal.handler.MockHandlerImpl.handle(MockHandlerImpl.java:96)
18-Jun-2019 08:14:06             at org.mockito.internal.handler.NullResultGuardian.handle(NullResultGuardian.java:29)
18-Jun-2019 08:14:06             at org.mockito.internal.handler.InvocationNotifierHandler.handle(InvocationNotifierHandler.java:35)
18-Jun-2019 08:14:06             at org.mockito.internal.creation.bytebuddy.MockMethodInterceptor.doIntercept(MockMethodInterceptor.java:61)
18-Jun-2019 08:14:06             at org.mockito.internal.creation.bytebuddy.MockMethodInterceptor.doIntercept(MockMethodInterceptor.java:49)
18-Jun-2019 08:14:06             at org.mockito.internal.creation.bytebuddy.MockMethodInterceptor$DispatcherDefaultingToRealMethod.interceptAbstract(MockMethodInterceptor.java:126)
18-Jun-2019 08:14:06             at com.rabbitmq.client.Channel$MockitoMock$787768334.basicPublish(Unknown Source)
18-Jun-2019 08:14:06             at reactor.rabbitmq.Sender$PublishConfirmSubscriber.onNext(Sender.java:622)
18-Jun-2019 08:14:06             ... 37 common frames omitted
18-Jun-2019 08:14:06
18-Jun-2019 08:14:06 reactor.rabbitmq.RabbitFluxTests > partitions() STANDARD_OUT
18-Jun-2019 08:14:06     08:14:06.837 [pool-200-thread-10] WARN  reactor.rabbitmq.Receiver - Error while closing channel: null
18-Jun-2019 08:14:07
18-Jun-2019 08:14:07 Gradle Test Executor 1 finished executing tests.
18-Jun-2019 08:14:07
18-Jun-2019 08:14:07 > Task :test
18-Jun-2019 08:14:07 Finished generating test XML results (0.015 secs) into: /opt/bamboo-home/xml-data/build-dir/REACTOR-REACTORRMQ-NETTY/build/test-results/test
18-Jun-2019 08:14:07 Generating HTML test report...
18-Jun-2019 08:14:07 Finished generating test html results (0.019 secs) into: /opt/bamboo-home/xml-data/build-dir/REACTOR-REACTORRMQ-NETTY/build/reports/tests/test
18-Jun-2019 08:14:07 :test (Thread[Execution worker for ':' Thread 3,5,main]) completed. Took 25.828 secs.
18-Jun-2019 08:14:07 :jar (Thread[Execution worker for ':' Thread 2,5,main]) started.
18-Jun-2019 08:14:07
18-Jun-2019 08:14:07 > Task :jar
18-Jun-2019 08:14:07 Caching disabled for task ':jar' because:
18-Jun-2019 08:14:07   Build cache is disabled
18-Jun-2019 08:14:07 Task ':jar' is not up-to-date because:
18-Jun-2019 08:14:07   No history is available.
18-Jun-2019 08:14:07 :jar (Thread[Execution worker for ':' Thread 2,5,main]) completed. Took 0.026 secs.
18-Jun-2019 08:14:07 :reactor-rabbitmq-samples:compileJava (Thread[Execution worker for ':',5,main]) started.
18-Jun-2019 08:14:09
18-Jun-2019 08:14:09 > Task :reactor-rabbitmq-samples:compileJava
18-Jun-2019 08:14:09 Found locally available resource with matching checksum: [https://repo.spring.io/libs-release/org/springframework/boot/spring-boot-starter/2.1.5.RELEASE/spring-boot-starter-2.1.5.RELEASE.pom, /opt/users/bamboo/.gradle/caches/modules-2/files-2.1/org.springframework.boot/spring-boot-starter/2.1.5.RELEASE/4bc1edabeaac229d3b4062f0a1c9ed7965144aeb/spring-boot-starter-2.1.5.RELEASE.pom]
18-Jun-2019 08:14:09 Found locally available resource with matching checksum: [https://repo.spring.io/libs-release/org/springframework/boot/spring-boot-starters/2.1.5.RELEASE/spring-boot-starters-2.1.5.RELEASE.pom, /opt/users/bamboo/.gradle/caches/modules-2/files-2.1/org.springframework.boot/spring-boot-starters/2.1.5.RELEASE/1b71c8ce9cee982351c1587ed236da73beece003/spring-boot-starters-2.1.5.RELEASE.pom]
18-Jun-2019 08:14:09 Downloading https://repo.spring.io/libs-release/org/springframework/amqp/spring-rabbit/2.1.7.RELEASE/spring-rabbit-2.1.7.RELEASE.pom to /tmp/gradle_download156132528375933481bin
18-Jun-2019 08:14:09 Found locally available resource with matching checksum: [https://repo.spring.io/libs-release/org/springframework/boot/spring-boot-parent/2.1.5.RELEASE/spring-boot-parent-2.1.5.RELEASE.pom, /opt/users/bamboo/.gradle/caches/modules-2/files-2.1/org.springframework.boot/spring-boot-parent/2.1.5.RELEASE/cc03b7dead3edde0ddec6d416cb62f9b39b31de9/spring-boot-parent-2.1.5.RELEASE.pom]
18-Jun-2019 08:14:09 Found locally available resource with matching checksum: [https://repo.spring.io/libs-release/org/springframework/boot/spring-boot-dependencies/2.1.5.RELEASE/spring-boot-dependencies-2.1.5.RELEASE.pom, /opt/users/bamboo/.gradle/caches/modules-2/files-2.1/org.springframework.boot/spring-boot-dependencies/2.1.5.RELEASE/8236d02bee9be43cf57adf4abb8c815b555aee17/spring-boot-dependencies-2.1.5.RELEASE.pom]
18-Jun-2019 08:14:09 Found locally available resource with matching checksum: [https://repo.spring.io/libs-release/io/netty/netty-bom/4.1.36.Final/netty-bom-4.1.36.Final.pom, /opt/users/bamboo/.gradle/caches/modules-2/files-2.1/io.netty/netty-bom/4.1.36.Final/524a72b99bfd4b52a3030e1a8e9259cfc2d57526/netty-bom-4.1.36.Final.pom]
18-Jun-2019 08:14:09 Found locally available resource with matching checksum: [https://repo.spring.io/libs-release/io/projectreactor/reactor-bom/Californium-SR8/reactor-bom-Californium-SR8.pom, /opt/users/bamboo/.gradle/caches/modules-2/files-2.1/io.projectreactor/reactor-bom/Californium-SR8/1ce22447d18d8a88424283dda443245d3f094c65/reactor-bom-Californium-SR8.pom]
18-Jun-2019 08:14:09 Found locally available resource with matching checksum: [https://repo.spring.io/libs-release/org/eclipse/jetty/jetty-bom/9.4.18.v20190429/jetty-bom-9.4.18.v20190429.pom, /opt/users/bamboo/.gradle/caches/modules-2/files-2.1/org.eclipse.jetty/jetty-bom/9.4.18.v20190429/ff85c1b99d0348414d89d1d0a5885f694da31945/jetty-bom-9.4.18.v20190429.pom]
18-Jun-2019 08:14:09 Found locally available resource with matching checksum: [https://repo.spring.io/libs-release/org/springframework/spring-framework-bom/5.1.7.RELEASE/spring-framework-bom-5.1.7.RELEASE.pom, /opt/users/bamboo/.gradle/caches/modules-2/files-2.1/org.springframework/spring-framework-bom/5.1.7.RELEASE/42b6f4050dd509151ed8090676f10b6d3cab6c4b/spring-framework-bom-5.1.7.RELEASE.pom]
18-Jun-2019 08:14:09 Found locally available resource with matching checksum: [https://repo.spring.io/libs-release/org/springframework/data/spring-data-releasetrain/Lovelace-SR8/spring-data-releasetrain-Lovelace-SR8.pom, /opt/users/bamboo/.gradle/caches/modules-2/files-2.1/org.springframework.data/spring-data-releasetrain/Lovelace-SR8/4badea33061c4bcf07990fe81cdc450e81f6ae25/spring-data-releasetrain-Lovelace-SR8.pom]
18-Jun-2019 08:14:09 Found locally available resource with matching checksum: [https://repo.spring.io/libs-release/org/springframework/data/build/spring-data-build/2.1.8.RELEASE/spring-data-build-2.1.8.RELEASE.pom, /home/bamboo/.m2/repository/org/springframework/data/build/spring-data-build/2.1.8.RELEASE/spring-data-build-2.1.8.RELEASE.pom]
18-Jun-2019 08:14:09 Found locally available resource with matching checksum: [https://repo.spring.io/libs-release/org/springframework/integration/spring-integration-bom/5.1.5.RELEASE/spring-integration-bom-5.1.5.RELEASE.pom, /opt/users/bamboo/.gradle/caches/modules-2/files-2.1/org.springframework.integration/spring-integration-bom/5.1.5.RELEASE/90f87488bfb9428b8128ee18386f90e64528b5f9/spring-integration-bom-5.1.5.RELEASE.pom]
18-Jun-2019 08:14:09 Found locally available resource with matching checksum: [https://repo.spring.io/libs-release/org/springframework/security/spring-security-bom/5.1.5.RELEASE/spring-security-bom-5.1.5.RELEASE.pom, /opt/users/bamboo/.gradle/caches/modules-2/files-2.1/org.springframework.security/spring-security-bom/5.1.5.RELEASE/35fb74bcc764eb932975e45f1f697091b193bb3d/spring-security-bom-5.1.5.RELEASE.pom]
18-Jun-2019 08:14:09 Found locally available resource with matching checksum: [https://repo.spring.io/libs-release/org/springframework/session/spring-session-bom/Bean-SR5/spring-session-bom-Bean-SR5.pom, /opt/users/bamboo/.gradle/caches/modules-2/files-2.1/org.springframework.session/spring-session-bom/Bean-SR5/9f64df516f88ca6910f31bff14e15cfe719e5d32/spring-session-bom-Bean-SR5.pom]
18-Jun-2019 08:14:09 Found locally available resource with matching checksum: [https://repo.spring.io/libs-release/org/springframework/spring-core/5.1.7.RELEASE/spring-core-5.1.7.RELEASE.pom, /opt/users/bamboo/.gradle/caches/modules-2/files-2.1/org.springframework/spring-core/5.1.7.RELEASE/92e7a901b608db72a95e7b96b22b4eeaeffe2cf2/spring-core-5.1.7.RELEASE.pom]
18-Jun-2019 08:14:09 Found locally available resource with matching checksum: [https://repo.spring.io/libs-release/org/springframework/boot/spring-boot-autoconfigure/2.1.5.RELEASE/spring-boot-autoconfigure-2.1.5.RELEASE.pom, /opt/users/bamboo/.gradle/caches/modules-2/files-2.1/org.springframework.boot/spring-boot-autoconfigure/2.1.5.RELEASE/f34ccbdd16d1d6268c5d904b75a9a029a0cd723d/spring-boot-autoconfigure-2.1.5.RELEASE.pom]
18-Jun-2019 08:14:09 Found locally available resource with matching checksum: [https://repo.spring.io/libs-release/org/springframework/boot/spring-boot-starter-logging/2.1.5.RELEASE/spring-boot-starter-logging-2.1.5.RELEASE.pom, /opt/users/bamboo/.gradle/caches/modules-2/files-2.1/org.springframework.boot/spring-boot-starter-logging/2.1.5.RELEASE/904c180922388eaf84d4443761e280bfb10833ec/spring-boot-starter-logging-2.1.5.RELEASE.pom]
18-Jun-2019 08:14:09 Found locally available resource with matching checksum: [https://repo.spring.io/libs-release/org/springframework/boot/spring-boot/2.1.5.RELEASE/spring-boot-2.1.5.RELEASE.pom, /opt/users/bamboo/.gradle/caches/modules-2/files-2.1/org.springframework.boot/spring-boot/2.1.5.RELEASE/22fc519bef51e0c211ec8c923ec1caa30fc99de2/spring-boot-2.1.5.RELEASE.pom]
18-Jun-2019 08:14:09 Found locally available resource with matching checksum: [https://repo.spring.io/libs-release/org/springframework/spring-tx/5.1.8.RELEASE/spring-tx-5.1.8.RELEASE.pom, /home/bamboo/.m2/repository/org/springframework/spring-tx/5.1.8.RELEASE/spring-tx-5.1.8.RELEASE.pom]
18-Jun-2019 08:14:09 Found locally available resource with matching checksum: [https://repo.spring.io/libs-release/org/springframework/spring-context/5.1.8.RELEASE/spring-context-5.1.8.RELEASE.pom, /home/bamboo/.m2/repository/org/springframework/spring-context/5.1.8.RELEASE/spring-context-5.1.8.RELEASE.pom]
18-Jun-2019 08:14:09 Downloading https://repo.spring.io/libs-release/org/springframework/spring-messaging/5.1.8.RELEASE/spring-messaging-5.1.8.RELEASE.pom to /tmp/gradle_download8940977684011355587bin
18-Jun-2019 08:14:09 Downloading https://repo.spring.io/libs-release/org/springframework/amqp/spring-amqp/2.1.7.RELEASE/spring-amqp-2.1.7.RELEASE.pom to /tmp/gradle_download5652523718931048762bin
18-Jun-2019 08:14:09 Found locally available resource with matching checksum: [https://repo.spring.io/libs-release/org/slf4j/jul-to-slf4j/1.7.26/jul-to-slf4j-1.7.26.pom, /opt/users/bamboo/.gradle/caches/modules-2/files-2.1/org.slf4j/jul-to-slf4j/1.7.26/c86321c3aded034349c7481fde63120c076132b2/jul-to-slf4j-1.7.26.pom]
18-Jun-2019 08:14:09 Found locally available resource with matching checksum: [https://repo.spring.io/libs-release/org/springframework/spring-jcl/5.1.7.RELEASE/spring-jcl-5.1.7.RELEASE.pom, /opt/users/bamboo/.gradle/caches/modules-2/files-2.1/org.springframework/spring-jcl/5.1.7.RELEASE/a3b51a70f968b80bbdb2eb24f96bf6b0b331d122/spring-jcl-5.1.7.RELEASE.pom]
18-Jun-2019 08:14:09 Found locally available resource with matching checksum: [https://repo.spring.io/libs-release/org/springframework/spring-core/5.1.8.RELEASE/spring-core-5.1.8.RELEASE.pom, /home/bamboo/.m2/repository/org/springframework/spring-core/5.1.8.RELEASE/spring-core-5.1.8.RELEASE.pom]
18-Jun-2019 08:14:10 Found locally available resource with matching checksum: [https://repo.spring.io/libs-release/org/springframework/spring-beans/5.1.8.RELEASE/spring-beans-5.1.8.RELEASE.pom, /home/bamboo/.m2/repository/org/springframework/spring-beans/5.1.8.RELEASE/spring-beans-5.1.8.RELEASE.pom]
18-Jun-2019 08:14:10 Found locally available resource with matching checksum: [https://repo.spring.io/libs-release/org/springframework/spring-aop/5.1.8.RELEASE/spring-aop-5.1.8.RELEASE.pom, /home/bamboo/.m2/repository/org/springframework/spring-aop/5.1.8.RELEASE/spring-aop-5.1.8.RELEASE.pom]
18-Jun-2019 08:14:10 Found locally available resource with matching checksum: [https://repo.spring.io/libs-release/org/springframework/spring-expression/5.1.8.RELEASE/spring-expression-5.1.8.RELEASE.pom, /home/bamboo/.m2/repository/org/springframework/spring-expression/5.1.8.RELEASE/spring-expression-5.1.8.RELEASE.pom]
18-Jun-2019 08:14:10 Found locally available resource with matching checksum: [https://repo.spring.io/libs-release/org/springframework/spring-jcl/5.1.8.RELEASE/spring-jcl-5.1.8.RELEASE.pom, /home/bamboo/.m2/repository/org/springframework/spring-jcl/5.1.8.RELEASE/spring-jcl-5.1.8.RELEASE.pom]
18-Jun-2019 08:14:10 Found locally available resource with matching checksum: [https://repo.spring.io/libs-release/org/springframework/boot/spring-boot-starter/2.1.5.RELEASE/spring-boot-starter-2.1.5.RELEASE.jar, /opt/users/bamboo/.gradle/caches/modules-2/files-2.1/org.springframework.boot/spring-boot-starter/2.1.5.RELEASE/74952d169c2da56f7794b3a88508e52005bb8f36/spring-boot-starter-2.1.5.RELEASE.jar]
18-Jun-2019 08:14:10 Found locally available resource with matching checksum: [https://repo.spring.io/libs-release/org/springframework/boot/spring-boot-starter-logging/2.1.5.RELEASE/spring-boot-starter-logging-2.1.5.RELEASE.jar, /opt/users/bamboo/.gradle/caches/modules-2/files-2.1/org.springframework.boot/spring-boot-starter-logging/2.1.5.RELEASE/b4fe11fb0e606b67b9fb2bd9ae4fe65b484445dd/spring-boot-starter-logging-2.1.5.RELEASE.jar]
18-Jun-2019 08:14:10 Found locally available resource with matching checksum: [https://repo.spring.io/libs-release/org/springframework/boot/spring-boot-autoconfigure/2.1.5.RELEASE/spring-boot-autoconfigure-2.1.5.RELEASE.jar, /opt/users/bamboo/.gradle/caches/modules-2/files-2.1/org.springframework.boot/spring-boot-autoconfigure/2.1.5.RELEASE/69ae2819b295603563b95f79abae53f2631c5b94/spring-boot-autoconfigure-2.1.5.RELEASE.jar]
18-Jun-2019 08:14:10 Downloading https://repo.spring.io/libs-release/org/springframework/amqp/spring-rabbit/2.1.7.RELEASE/spring-rabbit-2.1.7.RELEASE.jar to /tmp/gradle_download8517022256343960555bin
18-Jun-2019 08:14:10 Found locally available resource with matching checksum: [https://repo.spring.io/libs-release/org/springframework/boot/spring-boot/2.1.5.RELEASE/spring-boot-2.1.5.RELEASE.jar, /opt/users/bamboo/.gradle/caches/modules-2/files-2.1/org.springframework.boot/spring-boot/2.1.5.RELEASE/939061a385b4e30e115978d78a7412fb984674df/spring-boot-2.1.5.RELEASE.jar]
18-Jun-2019 08:14:10 Found locally available resource with matching checksum: [https://repo.spring.io/libs-release/org/springframework/spring-context/5.1.8.RELEASE/spring-context-5.1.8.RELEASE.jar, /home/bamboo/.m2/repository/org/springframework/spring-context/5.1.8.RELEASE/spring-context-5.1.8.RELEASE.jar]
18-Jun-2019 08:14:10 Downloading https://repo.spring.io/libs-release/org/springframework/amqp/spring-amqp/2.1.7.RELEASE/spring-amqp-2.1.7.RELEASE.jar to /tmp/gradle_download6499716150536257575bin
18-Jun-2019 08:14:10 Found locally available resource with matching checksum: [https://repo.spring.io/libs-release/org/springframework/spring-tx/5.1.8.RELEASE/spring-tx-5.1.8.RELEASE.jar, /home/bamboo/.m2/repository/org/springframework/spring-tx/5.1.8.RELEASE/spring-tx-5.1.8.RELEASE.jar]
18-Jun-2019 08:14:10 Downloading https://repo.spring.io/libs-release/org/springframework/spring-messaging/5.1.8.RELEASE/spring-messaging-5.1.8.RELEASE.jar to /tmp/gradle_download2029455161689089274bin
18-Jun-2019 08:14:10 Found locally available resource with matching checksum: [https://repo.spring.io/libs-release/org/springframework/spring-aop/5.1.8.RELEASE/spring-aop-5.1.8.RELEASE.jar, /home/bamboo/.m2/repository/org/springframework/spring-aop/5.1.8.RELEASE/spring-aop-5.1.8.RELEASE.jar]
18-Jun-2019 08:14:10 Found locally available resource with matching checksum: [https://repo.spring.io/libs-release/org/springframework/spring-beans/5.1.8.RELEASE/spring-beans-5.1.8.RELEASE.jar, /home/bamboo/.m2/repository/org/springframework/spring-beans/5.1.8.RELEASE/spring-beans-5.1.8.RELEASE.jar]
18-Jun-2019 08:14:10 Found locally available resource with matching checksum: [https://repo.spring.io/libs-release/org/springframework/spring-expression/5.1.8.RELEASE/spring-expression-5.1.8.RELEASE.jar, /home/bamboo/.m2/repository/org/springframework/spring-expression/5.1.8.RELEASE/spring-expression-5.1.8.RELEASE.jar]
18-Jun-2019 08:14:10 Found locally available resource with matching checksum: [https://repo.spring.io/libs-release/org/springframework/spring-core/5.1.8.RELEASE/spring-core-5.1.8.RELEASE.jar, /home/bamboo/.m2/repository/org/springframework/spring-core/5.1.8.RELEASE/spring-core-5.1.8.RELEASE.jar]
18-Jun-2019 08:14:10 Found locally available resource with matching checksum: [https://repo.spring.io/libs-release/org/springframework/spring-jcl/5.1.8.RELEASE/spring-jcl-5.1.8.RELEASE.jar, /home/bamboo/.m2/repository/org/springframework/spring-jcl/5.1.8.RELEASE/spring-jcl-5.1.8.RELEASE.jar]
18-Jun-2019 08:14:10 Found locally available resource with matching checksum: [https://repo.spring.io/libs-release/org/slf4j/jul-to-slf4j/1.7.26/jul-to-slf4j-1.7.26.jar, /opt/users/bamboo/.gradle/caches/modules-2/files-2.1/org.slf4j/jul-to-slf4j/1.7.26/8031352b2bb0a49e67818bf04c027aa92e645d5c/jul-to-slf4j-1.7.26.jar]
18-Jun-2019 08:14:11 Caching disabled for task ':reactor-rabbitmq-samples:compileJava' because:
18-Jun-2019 08:14:11   Build cache is disabled
18-Jun-2019 08:14:11 Task ':reactor-rabbitmq-samples:compileJava' is not up-to-date because:
18-Jun-2019 08:14:11   No history is available.
18-Jun-2019 08:14:11 All input files are considered out-of-date for incremental task ':reactor-rabbitmq-samples:compileJava'.
18-Jun-2019 08:14:11 Full recompilation is required because no incremental change information is available. This is usually caused by clean builds or changing compiler arguments.
18-Jun-2019 08:14:11 Compiling with JDK Java compiler API.
18-Jun-2019 08:14:12 Created classpath snapshot for incremental compilation in 0.81 secs.
18-Jun-2019 08:14:12 :reactor-rabbitmq-samples:compileJava (Thread[Execution worker for ':',5,main]) completed. Took 4.23 secs.
18-Jun-2019 08:14:12 :reactor-rabbitmq-samples:processResources (Thread[Execution worker for ':',5,main]) started.
18-Jun-2019 08:14:12
18-Jun-2019 08:14:12 > Task :reactor-rabbitmq-samples:processResources
18-Jun-2019 08:14:12 Caching disabled for task ':reactor-rabbitmq-samples:processResources' because:
18-Jun-2019 08:14:12   Build cache is disabled
18-Jun-2019 08:14:12 Task ':reactor-rabbitmq-samples:processResources' is not up-to-date because:
18-Jun-2019 08:14:12   No history is available.
18-Jun-2019 08:14:12 :reactor-rabbitmq-samples:processResources (Thread[Execution worker for ':',5,main]) completed. Took 0.002 secs.
18-Jun-2019 08:14:12 :reactor-rabbitmq-samples:classes (Thread[Execution worker for ':',5,main]) started.
18-Jun-2019 08:14:12
18-Jun-2019 08:14:12 > Task :reactor-rabbitmq-samples:classes
18-Jun-2019 08:14:12 Skipping task ':reactor-rabbitmq-samples:classes' as it has no actions.
18-Jun-2019 08:14:12 :reactor-rabbitmq-samples:classes (Thread[Execution worker for ':',5,main]) completed. Took 0.0 secs.
18-Jun-2019 08:14:12 :reactor-rabbitmq-samples:compileTestJava (Thread[Execution worker for ':',5,main]) started.
18-Jun-2019 08:14:12
18-Jun-2019 08:14:12 > Task :reactor-rabbitmq-samples:compileTestJava
18-Jun-2019 08:14:12 Caching disabled for task ':reactor-rabbitmq-samples:compileTestJava' because:
18-Jun-2019 08:14:12   Build cache is disabled
18-Jun-2019 08:14:12 Task ':reactor-rabbitmq-samples:compileTestJava' is not up-to-date because:
18-Jun-2019 08:14:12   No history is available.
18-Jun-2019 08:14:12 All input files are considered out-of-date for incremental task ':reactor-rabbitmq-samples:compileTestJava'.
18-Jun-2019 08:14:12 Full recompilation is required because no incremental change information is available. This is usually caused by clean builds or changing compiler arguments.
18-Jun-2019 08:14:12 Compiling with JDK Java compiler API.
18-Jun-2019 08:14:12 Created classpath snapshot for incremental compilation in 0.012 secs. 1 duplicate classes found in classpath (see all with --debug).
18-Jun-2019 08:14:12 :reactor-rabbitmq-samples:compileTestJava (Thread[Execution worker for ':',5,main]) completed. Took 0.096 secs.
18-Jun-2019 08:14:12 :reactor-rabbitmq-samples:processTestResources (Thread[Execution worker for ':',5,main]) started.
18-Jun-2019 08:14:12
18-Jun-2019 08:14:12 > Task :reactor-rabbitmq-samples:processTestResources
18-Jun-2019 08:14:12 Caching disabled for task ':reactor-rabbitmq-samples:processTestResources' because:
18-Jun-2019 08:14:12   Build cache is disabled
18-Jun-2019 08:14:12 Task ':reactor-rabbitmq-samples:processTestResources' is not up-to-date because:
18-Jun-2019 08:14:12   No history is available.
18-Jun-2019 08:14:12 :reactor-rabbitmq-samples:processTestResources (Thread[Execution worker for ':',5,main]) completed. Took 0.002 secs.
18-Jun-2019 08:14:12 :reactor-rabbitmq-samples:testClasses (Thread[Execution worker for ':',5,main]) started.
18-Jun-2019 08:14:12
18-Jun-2019 08:14:12 > Task :reactor-rabbitmq-samples:testClasses
18-Jun-2019 08:14:12 Skipping task ':reactor-rabbitmq-samples:testClasses' as it has no actions.
18-Jun-2019 08:14:12 :reactor-rabbitmq-samples:testClasses (Thread[Execution worker for ':',5,main]) completed. Took 0.0 secs.
18-Jun-2019 08:14:12 :reactor-rabbitmq-samples:test (Thread[Execution worker for ':',5,main]) started.
18-Jun-2019 08:14:13 Gradle Test Executor 2 started executing tests.
18-Jun-2019 08:14:14
18-Jun-2019 08:14:14 > Task :reactor-rabbitmq-samples:test
18-Jun-2019 08:14:14 Found locally available resource with matching checksum: [https://repo.spring.io/libs-release/org/springframework/boot/spring-boot-starter-test/2.1.5.RELEASE/spring-boot-starter-test-2.1.5.RELEASE.pom, /opt/users/bamboo/.gradle/caches/modules-2/files-2.1/org.springframework.boot/spring-boot-starter-test/2.1.5.RELEASE/d6dd72577791c78f4d4aa34f9a0ce5a7b1e4b752/spring-boot-starter-test-2.1.5.RELEASE.pom]
18-Jun-2019 08:14:14 Found locally available resource with matching checksum: [https://repo.spring.io/libs-release/org/springframework/boot/spring-boot-test-autoconfigure/2.1.5.RELEASE/spring-boot-test-autoconfigure-2.1.5.RELEASE.pom, /opt/users/bamboo/.gradle/caches/modules-2/files-2.1/org.springframework.boot/spring-boot-test-autoconfigure/2.1.5.RELEASE/278eea5788d23a6972013e7814132d2cc7c277e4/spring-boot-test-autoconfigure-2.1.5.RELEASE.pom]
18-Jun-2019 08:14:14 Found locally available resource with matching checksum: [https://repo.spring.io/libs-release/org/springframework/boot/spring-boot-test/2.1.5.RELEASE/spring-boot-test-2.1.5.RELEASE.pom, /opt/users/bamboo/.gradle/caches/modules-2/files-2.1/org.springframework.boot/spring-boot-test/2.1.5.RELEASE/f3103548e54af9d95e9871e503b57684544d50bd/spring-boot-test-2.1.5.RELEASE.pom]
18-Jun-2019 08:14:14 Found locally available resource with matching checksum: [https://repo.spring.io/libs-release/org/springframework/spring-test/5.1.7.RELEASE/spring-test-5.1.7.RELEASE.pom, /opt/users/bamboo/.gradle/caches/modules-2/files-2.1/org.springframework/spring-test/5.1.7.RELEASE/44e5488f528ccf5e2cdf78ac63e0834a480866dd/spring-test-5.1.7.RELEASE.pom]
18-Jun-2019 08:14:14 Found locally available resource with matching checksum: [https://repo.spring.io/libs-release/org/springframework/boot/spring-boot-starter-test/2.1.5.RELEASE/spring-boot-starter-test-2.1.5.RELEASE.jar, /opt/users/bamboo/.gradle/caches/modules-2/files-2.1/org.springframework.boot/spring-boot-starter-test/2.1.5.RELEASE/48c367b0c6e82377ebbc84125e904ae987b90cff/spring-boot-starter-test-2.1.5.RELEASE.jar]
18-Jun-2019 08:14:14 Found locally available resource with matching checksum: [https://repo.spring.io/libs-release/org/springframework/boot/spring-boot-test-autoconfigure/2.1.5.RELEASE/spring-boot-test-autoconfigure-2.1.5.RELEASE.jar, /opt/users/bamboo/.gradle/caches/modules-2/files-2.1/org.springframework.boot/spring-boot-test-autoconfigure/2.1.5.RELEASE/e55241ea53f6235709f3fdef3a4b715c92d39146/spring-boot-test-autoconfigure-2.1.5.RELEASE.jar]
18-Jun-2019 08:14:14 Found locally available resource with matching checksum: [https://repo.spring.io/libs-release/org/springframework/spring-test/5.1.7.RELEASE/spring-test-5.1.7.RELEASE.jar, /opt/users/bamboo/.gradle/caches/modules-2/files-2.1/org.springframework/spring-test/5.1.7.RELEASE/936c1a9ce4ba45889cf66be9276dabe5e4068a58/spring-test-5.1.7.RELEASE.jar]
18-Jun-2019 08:14:14 Found locally available resource with matching checksum: [https://repo.spring.io/libs-release/org/springframework/boot/spring-boot-test/2.1.5.RELEASE/spring-boot-test-2.1.5.RELEASE.jar, /opt/users/bamboo/.gradle/caches/modules-2/files-2.1/org.springframework.boot/spring-boot-test/2.1.5.RELEASE/1cbe5298015a969e3fbeec322396df98e01aa26/spring-boot-test-2.1.5.RELEASE.jar]
18-Jun-2019 08:14:14 Caching disabled for task ':reactor-rabbitmq-samples:test' because:
18-Jun-2019 08:14:14   Build cache is disabled
18-Jun-2019 08:14:14 Task ':reactor-rabbitmq-samples:test' is not up-to-date because:
18-Jun-2019 08:14:14   Task.upToDateWhen is false.
18-Jun-2019 08:14:14 Starting process 'Gradle Test Executor 2'. Working directory: /opt/bamboo-home/xml-data/build-dir/REACTOR-REACTORRMQ-NETTY/reactor-rabbitmq-samples Command: /opt/jdk8u212-b03/bin/java -Djava.security.manager=worker.org.gradle.process.internal.worker.child.BootstrapSecurityManager -Dorg.gradle.native=false -Xmx512m -Dfile.encoding=UTF-8 -Duser.country=US -Duser.language=en -Duser.variant -ea -cp /opt/users/bamboo/.gradle/caches/5.4/workerMain/gradle-worker.jar worker.org.gradle.process.internal.worker.GradleWorkerMain 'Gradle Test Executor 2'
18-Jun-2019 08:14:14 Successfully started process 'Gradle Test Executor 2'
18-Jun-2019 08:14:14
18-Jun-2019 08:14:14 reactor.rabbitmq.samples.SamplesTest > SenderReceiver() STANDARD_OUT
18-Jun-2019 08:14:14     08:14:13.627 [rabbitmq-nio] INFO  r.rabbitmq.samples.SampleSender - Message Message_1 sent successfully
18-Jun-2019 08:14:14     08:14:13.632 [rabbitmq-nio] INFO  r.rabbitmq.samples.SampleSender - Message Message_2 sent successfully
18-Jun-2019 08:14:14     08:14:13.633 [rabbitmq-nio] INFO  r.rabbitmq.samples.SampleSender - Message Message_3 sent successfully
18-Jun-2019 08:14:14     08:14:13.633 [rabbitmq-nio] INFO  r.rabbitmq.samples.SampleSender - Message Message_4 sent successfully
18-Jun-2019 08:14:14     08:14:13.634 [rabbitmq-nio] INFO  r.rabbitmq.samples.SampleSender - Message Message_5 sent successfully
18-Jun-2019 08:14:14     08:14:13.634 [rabbitmq-nio] INFO  r.rabbitmq.samples.SampleSender - Message Message_6 sent successfully
18-Jun-2019 08:14:14     08:14:13.634 [rabbitmq-nio] INFO  r.rabbitmq.samples.SampleSender - Message Message_7 sent successfully
18-Jun-2019 08:14:14     08:14:13.634 [rabbitmq-nio] INFO  r.rabbitmq.samples.SampleSender - Message Message_8 sent successfully
18-Jun-2019 08:14:14     08:14:13.635 [rabbitmq-nio] INFO  r.rabbitmq.samples.SampleSender - Message Message_9 sent successfully
18-Jun-2019 08:14:14     08:14:13.635 [rabbitmq-nio] INFO  r.rabbitmq.samples.SampleSender - Message Message_10 sent successfully
18-Jun-2019 08:14:14     08:14:13.643 [pool-1-thread-4] INFO  r.rabbitmq.samples.SampleReceiver - Received message Message_1
18-Jun-2019 08:14:14     08:14:13.643 [pool-1-thread-5] INFO  r.rabbitmq.samples.SampleReceiver - Received message Message_2
18-Jun-2019 08:14:14     08:14:13.643 [pool-1-thread-5] INFO  r.rabbitmq.samples.SampleReceiver - Received message Message_3
18-Jun-2019 08:14:14     08:14:13.644 [pool-1-thread-5] INFO  r.rabbitmq.samples.SampleReceiver - Received message Message_4
18-Jun-2019 08:14:14     08:14:13.644 [pool-1-thread-5] INFO  r.rabbitmq.samples.SampleReceiver - Received message Message_5
18-Jun-2019 08:14:14     08:14:13.644 [pool-1-thread-6] INFO  r.rabbitmq.samples.SampleReceiver - Received message Message_6
18-Jun-2019 08:14:14     08:14:13.644 [pool-1-thread-6] INFO  r.rabbitmq.samples.SampleReceiver - Received message Message_7
18-Jun-2019 08:14:14     08:14:13.644 [pool-1-thread-6] INFO  r.rabbitmq.samples.SampleReceiver - Received message Message_8
18-Jun-2019 08:14:14     08:14:13.645 [pool-1-thread-6] INFO  r.rabbitmq.samples.SampleReceiver - Received message Message_9
18-Jun-2019 08:14:14     08:14:13.645 [pool-1-thread-6] INFO  r.rabbitmq.samples.SampleReceiver - Received message Message_10
18-Jun-2019 08:14:14
18-Jun-2019 08:14:14 reactor.rabbitmq.samples.SpringBootSampleTest > test() STANDARD_OUT
18-Jun-2019 08:14:14
18-Jun-2019 08:14:14       .   ____          _            __ _ _
18-Jun-2019 08:14:14      /\\ / ___'_ __ _ _(_)_ __  __ _ \ \ \ \
18-Jun-2019 08:14:14     ( ( )\___ | '_ | '_| | '_ \/ _` | \ \ \ \
18-Jun-2019 08:14:14      \\/  ___)| |_)| | | | | || (_| |  ) ) ) )
18-Jun-2019 08:14:14       '  |____| .__|_| |_|_| |_\__, | / / / /
18-Jun-2019 08:14:14      =========|_|==============|___/=/_/_/_/
18-Jun-2019 08:14:14      :: Spring Boot ::        (v2.1.5.RELEASE)
18-Jun-2019 08:14:14
18-Jun-2019 08:14:14     08:14:14.012 [Test worker] INFO  o.s.boot.SpringApplication - Starting application on bamboo-16 with PID 19410 (started by bamboo in /opt/bamboo-home/xml-data/build-dir/REACTOR-REACTORRMQ-NETTY/reactor-rabbitmq-samples)
18-Jun-2019 08:14:14     08:14:14.012 [Test worker] INFO  o.s.boot.SpringApplication - No active profile set, falling back to default profiles: default
18-Jun-2019 08:14:14     08:14:14.493 [Test worker] INFO  o.s.a.r.c.CachingConnectionFactory - Attempting to connect to: [localhost:5672]
18-Jun-2019 08:14:14     08:14:14.500 [Test worker] INFO  o.s.a.r.c.CachingConnectionFactory - Created new connection: rabbitConnectionFactory#8cd2f8a:0/SimpleConnection@35ddeebf [delegate=amqp://guest@127.0.0.1:5672/, localPort= 38712]
18-Jun-2019 08:14:14     08:14:14.519 [AMQP Connection 127.0.0.1:5672] ERROR o.s.a.r.c.CachingConnectionFactory - Channel shutdown: channel error; protocol method: #method<channel.close>(reply-code=406, reply-text=PRECONDITION_FAILED - inequivalent arg 'durable' for queue 'reactor.rabbitmq.spring.boot' in vhost '/': received 'false' but current is 'true', class-id=50, method-id=10)
18-Jun-2019 08:14:14     08:14:14.522 [Test worker] WARN  o.s.c.a.AnnotationConfigApplicationContext - Exception encountered during context initialization - cancelling refresh attempt: org.springframework.beans.factory.BeanCreationException: Error creating bean with name 'springBootSample': Invocation of init method failed; nested exception is org.springframework.amqp.AmqpIOException: java.io.IOException
18-Jun-2019 08:14:14     08:14:14.532 [Test worker] INFO  o.s.b.a.l.ConditionEvaluationReportLoggingListener -
18-Jun-2019 08:14:14
18-Jun-2019 08:14:14     Error starting ApplicationContext. To display the conditions report re-run your application with 'debug' enabled.
18-Jun-2019 08:14:14     08:14:14.538 [Test worker] ERROR o.s.boot.SpringApplication - Application run failed
18-Jun-2019 08:14:14     org.springframework.beans.factory.BeanCreationException: Error creating bean with name 'springBootSample': Invocation of init method failed; nested exception is org.springframework.amqp.AmqpIOException: java.io.IOException
18-Jun-2019 08:14:14             at org.springframework.beans.factory.annotation.InitDestroyAnnotationBeanPostProcessor.postProcessBeforeInitialization(InitDestroyAnnotationBeanPostProcessor.java:139)
18-Jun-2019 08:14:14             at org.springframework.beans.factory.support.AbstractAutowireCapableBeanFactory.applyBeanPostProcessorsBeforeInitialization(AbstractAutowireCapableBeanFactory.java:414)
18-Jun-2019 08:14:14             at org.springframework.beans.factory.support.AbstractAutowireCapableBeanFactory.initializeBean(AbstractAutowireCapableBeanFactory.java:1770)
18-Jun-2019 08:14:14             at org.springframework.beans.factory.support.AbstractAutowireCapableBeanFactory.doCreateBean(AbstractAutowireCapableBeanFactory.java:593)
18-Jun-2019 08:14:14             at org.springframework.beans.factory.support.AbstractAutowireCapableBeanFactory.createBean(AbstractAutowireCapableBeanFactory.java:515)
18-Jun-2019 08:14:14             at org.springframework.beans.factory.support.AbstractBeanFactory.lambda$doGetBean$0(AbstractBeanFactory.java:320)
18-Jun-2019 08:14:14             at org.springframework.beans.factory.support.DefaultSingletonBeanRegistry.getSingleton(DefaultSingletonBeanRegistry.java:222)
18-Jun-2019 08:14:14             at org.springframework.beans.factory.support.AbstractBeanFactory.doGetBean(AbstractBeanFactory.java:318)
18-Jun-2019 08:14:14             at org.springframework.beans.factory.support.AbstractBeanFactory.getBean(AbstractBeanFactory.java:199)
18-Jun-2019 08:14:14             at org.springframework.beans.factory.support.DefaultListableBeanFactory.preInstantiateSingletons(DefaultListableBeanFactory.java:845)
18-Jun-2019 08:14:14             at org.springframework.context.support.AbstractApplicationContext.finishBeanFactoryInitialization(AbstractApplicationContext.java:877)
18-Jun-2019 08:14:14             at org.springframework.context.support.AbstractApplicationContext.refresh(AbstractApplicationContext.java:549)
18-Jun-2019 08:14:14             at org.springframework.boot.SpringApplication.refresh(SpringApplication.java:775)
18-Jun-2019 08:14:14             at org.springframework.boot.SpringApplication.refreshContext(SpringApplication.java:397)
18-Jun-2019 08:14:14             at org.springframework.boot.SpringApplication.run(SpringApplication.java:316)
18-Jun-2019 08:14:14             at org.springframework.boot.SpringApplication.run(SpringApplication.java:1260)
18-Jun-2019 08:14:14             at org.springframework.boot.SpringApplication.run(SpringApplication.java:1248)
18-Jun-2019 08:14:14             at reactor.rabbitmq.samples.SpringBootSampleTest.test(SpringBootSampleTest.java:29)
18-Jun-2019 08:14:14             at sun.reflect.NativeMethodAccessorImpl.invoke0(Native Method)
18-Jun-2019 08:14:14             at sun.reflect.NativeMethodAccessorImpl.invoke(NativeMethodAccessorImpl.java:62)
18-Jun-2019 08:14:14             at sun.reflect.DelegatingMethodAccessorImpl.invoke(DelegatingMethodAccessorImpl.java:43)
18-Jun-2019 08:14:14             at java.lang.reflect.Method.invoke(Method.java:498)
18-Jun-2019 08:14:14             at org.junit.platform.commons.util.ReflectionUtils.invokeMethod(ReflectionUtils.java:628)
18-Jun-2019 08:14:14             at org.junit.jupiter.engine.execution.ExecutableInvoker.invoke(ExecutableInvoker.java:117)
18-Jun-2019 08:14:14             at org.junit.jupiter.engine.descriptor.TestMethodTestDescriptor.lambda$invokeTestMethod$7(TestMethodTestDescriptor.java:184)
18-Jun-2019 08:14:14             at org.junit.platform.engine.support.hierarchical.ThrowableCollector.execute(ThrowableCollector.java:73)
18-Jun-2019 08:14:14             at org.junit.jupiter.engine.descriptor.TestMethodTestDescriptor.invokeTestMethod(TestMethodTestDescriptor.java:180)
18-Jun-2019 08:14:14             at org.junit.jupiter.engine.descriptor.TestMethodTestDescriptor.execute(TestMethodTestDescriptor.java:127)
18-Jun-2019 08:14:14             at org.junit.jupiter.engine.descriptor.TestMethodTestDescriptor.execute(TestMethodTestDescriptor.java:68)
18-Jun-2019 08:14:14             at org.junit.platform.engine.support.hierarchical.NodeTestTask.lambda$executeRecursively$5(NodeTestTask.java:135)
18-Jun-2019 08:14:14             at org.junit.platform.engine.support.hierarchical.ThrowableCollector.execute(ThrowableCollector.java:73)
18-Jun-2019 08:14:14             at org.junit.platform.engine.support.hierarchical.NodeTestTask.lambda$executeRecursively$7(NodeTestTask.java:125)
18-Jun-2019 08:14:14             at org.junit.platform.engine.support.hierarchical.Node.around(Node.java:135)
18-Jun-2019 08:14:14             at org.junit.platform.engine.support.hierarchical.NodeTestTask.lambda$executeRecursively$8(NodeTestTask.java:123)
18-Jun-2019 08:14:14             at org.junit.platform.engine.support.hierarchical.ThrowableCollector.execute(ThrowableCollector.java:73)
18-Jun-2019 08:14:14             at org.junit.platform.engine.support.hierarchical.NodeTestTask.executeRecursively(NodeTestTask.java:122)
18-Jun-2019 08:14:14             at org.junit.platform.engine.support.hierarchical.NodeTestTask.execute(NodeTestTask.java:80)
18-Jun-2019 08:14:14             at java.util.ArrayList.forEach(ArrayList.java:1257)
18-Jun-2019 08:14:14             at org.junit.platform.engine.support.hierarchical.SameThreadHierarchicalTestExecutorService.invokeAll(SameThreadHierarchicalTestExecutorService.java:38)
18-Jun-2019 08:14:14             at org.junit.platform.engine.support.hierarchical.NodeTestTask.lambda$executeRecursively$5(NodeTestTask.java:139)
18-Jun-2019 08:14:14             at org.junit.platform.engine.support.hierarchical.ThrowableCollector.execute(ThrowableCollector.java:73)
18-Jun-2019 08:14:14             at org.junit.platform.engine.support.hierarchical.NodeTestTask.lambda$executeRecursively$7(NodeTestTask.java:125)
18-Jun-2019 08:14:14             at org.junit.platform.engine.support.hierarchical.Node.around(Node.java:135)
18-Jun-2019 08:14:14             at org.junit.platform.engine.support.hierarchical.NodeTestTask.lambda$executeRecursively$8(NodeTestTask.java:123)
18-Jun-2019 08:14:14             at org.junit.platform.engine.support.hierarchical.ThrowableCollector.execute(ThrowableCollector.java:73)
18-Jun-2019 08:14:14             at org.junit.platform.engine.support.hierarchical.NodeTestTask.executeRecursively(NodeTestTask.java:122)
18-Jun-2019 08:14:14             at org.junit.platform.engine.support.hierarchical.NodeTestTask.execute(NodeTestTask.java:80)
18-Jun-2019 08:14:14             at java.util.ArrayList.forEach(ArrayList.java:1257)
18-Jun-2019 08:14:14             at org.junit.platform.engine.support.hierarchical.SameThreadHierarchicalTestExecutorService.invokeAll(SameThreadHierarchicalTestExecutorService.java:38)
18-Jun-2019 08:14:14             at org.junit.platform.engine.support.hierarchical.NodeTestTask.lambda$executeRecursively$5(NodeTestTask.java:139)
18-Jun-2019 08:14:14             at org.junit.platform.engine.support.hierarchical.ThrowableCollector.execute(ThrowableCollector.java:73)
18-Jun-2019 08:14:14             at org.junit.platform.engine.support.hierarchical.NodeTestTask.lambda$executeRecursively$7(NodeTestTask.java:125)
18-Jun-2019 08:14:14             at org.junit.platform.engine.support.hierarchical.Node.around(Node.java:135)
18-Jun-2019 08:14:14             at org.junit.platform.engine.support.hierarchical.NodeTestTask.lambda$executeRecursively$8(NodeTestTask.java:123)
18-Jun-2019 08:14:14             at org.junit.platform.engine.support.hierarchical.ThrowableCollector.execute(ThrowableCollector.java:73)
18-Jun-2019 08:14:14             at org.junit.platform.engine.support.hierarchical.NodeTestTask.executeRecursively(NodeTestTask.java:122)
18-Jun-2019 08:14:14             at org.junit.platform.engine.support.hierarchical.NodeTestTask.execute(NodeTestTask.java:80)
18-Jun-2019 08:14:14             at org.junit.platform.engine.support.hierarchical.SameThreadHierarchicalTestExecutorService.submit(SameThreadHierarchicalTestExecutorService.java:32)
18-Jun-2019 08:14:14             at org.junit.platform.engine.support.hierarchical.HierarchicalTestExecutor.execute(HierarchicalTestExecutor.java:57)
18-Jun-2019 08:14:14             at org.junit.platform.engine.support.hierarchical.HierarchicalTestEngine.execute(HierarchicalTestEngine.java:51)
18-Jun-2019 08:14:14             at org.junit.platform.launcher.core.DefaultLauncher.execute(DefaultLauncher.java:220)
18-Jun-2019 08:14:14             at org.junit.platform.launcher.core.DefaultLauncher.lambda$execute$6(DefaultLauncher.java:188)
18-Jun-2019 08:14:14             at org.junit.platform.launcher.core.DefaultLauncher.withInterceptedStreams(DefaultLauncher.java:202)
18-Jun-2019 08:14:14             at org.junit.platform.launcher.core.DefaultLauncher.execute(DefaultLauncher.java:181)
18-Jun-2019 08:14:14             at org.junit.platform.launcher.core.DefaultLauncher.execute(DefaultLauncher.java:128)
18-Jun-2019 08:14:14             at org.gradle.api.internal.tasks.testing.junitplatform.JUnitPlatformTestClassProcessor$CollectAllTestClassesExecutor.processAllTestClasses(JUnitPlatformTestClassProcessor.java:102)
18-Jun-2019 08:14:14             at org.gradle.api.internal.tasks.testing.junitplatform.JUnitPlatformTestClassProcessor$CollectAllTestClassesExecutor.access$000(JUnitPlatformTestClassProcessor.java:82)
18-Jun-2019 08:14:14             at org.gradle.api.internal.tasks.testing.junitplatform.JUnitPlatformTestClassProcessor.stop(JUnitPlatformTestClassProcessor.java:78)
18-Jun-2019 08:14:14             at org.gradle.api.internal.tasks.testing.SuiteTestClassProcessor.stop(SuiteTestClassProcessor.java:61)
18-Jun-2019 08:14:14             at sun.reflect.NativeMethodAccessorImpl.invoke0(Native Method)
18-Jun-2019 08:14:14             at sun.reflect.NativeMethodAccessorImpl.invoke(NativeMethodAccessorImpl.java:62)
18-Jun-2019 08:14:14             at sun.reflect.DelegatingMethodAccessorImpl.invoke(DelegatingMethodAccessorImpl.java:43)
18-Jun-2019 08:14:14             at java.lang.reflect.Method.invoke(Method.java:498)
18-Jun-2019 08:14:14             at org.gradle.internal.dispatch.ReflectionDispatch.dispatch(ReflectionDispatch.java:35)
18-Jun-2019 08:14:14             at org.gradle.internal.dispatch.ReflectionDispatch.dispatch(ReflectionDispatch.java:24)
18-Jun-2019 08:14:14             at org.gradle.internal.dispatch.ContextClassLoaderDispatch.dispatch(ContextClassLoaderDispatch.java:32)
18-Jun-2019 08:14:14             at org.gradle.internal.dispatch.ProxyDispatchAdapter$DispatchingInvocationHandler.invoke(ProxyDispatchAdapter.java:93)
18-Jun-2019 08:14:14             at com.sun.proxy.$Proxy2.stop(Unknown Source)
18-Jun-2019 08:14:14             at org.gradle.api.internal.tasks.testing.worker.TestWorker.stop(TestWorker.java:132)
18-Jun-2019 08:14:14             at sun.reflect.NativeMethodAccessorImpl.invoke0(Native Method)
18-Jun-2019 08:14:14             at sun.reflect.NativeMethodAccessorImpl.invoke(NativeMethodAccessorImpl.java:62)
18-Jun-2019 08:14:14             at sun.reflect.DelegatingMethodAccessorImpl.invoke(DelegatingMethodAccessorImpl.java:43)
18-Jun-2019 08:14:14             at java.lang.reflect.Method.invoke(Method.java:498)
18-Jun-2019 08:14:14             at org.gradle.internal.dispatch.ReflectionDispatch.dispatch(ReflectionDispatch.java:35)
18-Jun-2019 08:14:14             at org.gradle.internal.dispatch.ReflectionDispatch.dispatch(ReflectionDispatch.java:24)
18-Jun-2019 08:14:14             at org.gradle.internal.remote.internal.hub.MessageHubBackedObjectConnection$DispatchWrapper.dispatch(MessageHubBackedObjectConnection.java:175)
18-Jun-2019 08:14:14             at org.gradle.internal.remote.internal.hub.MessageHubBackedObjectConnection$DispatchWrapper.dispatch(MessageHubBackedObjectConnection.java:157)
18-Jun-2019 08:14:14             at org.gradle.internal.remote.internal.hub.MessageHub$Handler.run(MessageHub.java:404)
18-Jun-2019 08:14:14             at org.gradle.internal.concurrent.ExecutorPolicy$CatchAndRecordFailures.onExecute(ExecutorPolicy.java:63)
18-Jun-2019 08:14:14             at org.gradle.internal.concurrent.ManagedExecutorImpl$1.run(ManagedExecutorImpl.java:46)
18-Jun-2019 08:14:14             at java.util.concurrent.ThreadPoolExecutor.runWorker(ThreadPoolExecutor.java:1149)
18-Jun-2019 08:14:14             at java.util.concurrent.ThreadPoolExecutor$Worker.run(ThreadPoolExecutor.java:624)
18-Jun-2019 08:14:14             at org.gradle.internal.concurrent.ThreadFactoryImpl$ManagedThreadRunnable.run(ThreadFactoryImpl.java:55)
18-Jun-2019 08:14:14             at java.lang.Thread.run(Thread.java:748)
18-Jun-2019 08:14:14     Caused by: org.springframework.amqp.AmqpIOException: java.io.IOException
18-Jun-2019 08:14:14             at org.springframework.amqp.rabbit.support.RabbitExceptionTranslator.convertRabbitAccessException(RabbitExceptionTranslator.java:71)
18-Jun-2019 08:14:14             at org.springframework.amqp.rabbit.connection.RabbitAccessor.convertRabbitAccessException(RabbitAccessor.java:116)
18-Jun-2019 08:14:14             at org.springframework.amqp.rabbit.core.RabbitTemplate.doExecute(RabbitTemplate.java:2100)
18-Jun-2019 08:14:14             at org.springframework.amqp.rabbit.core.RabbitTemplate.execute(RabbitTemplate.java:2047)
18-Jun-2019 08:14:14             at org.springframework.amqp.rabbit.core.RabbitTemplate.execute(RabbitTemplate.java:2027)
18-Jun-2019 08:14:14             at org.springframework.amqp.rabbit.core.RabbitAdmin.declareQueue(RabbitAdmin.java:277)
18-Jun-2019 08:14:14             at reactor.rabbitmq.samples.SpringBootSample.init(SpringBootSample.java:86)
18-Jun-2019 08:14:14             at sun.reflect.NativeMethodAccessorImpl.invoke0(Native Method)
18-Jun-2019 08:14:14             at sun.reflect.NativeMethodAccessorImpl.invoke(NativeMethodAccessorImpl.java:62)
18-Jun-2019 08:14:14             at sun.reflect.DelegatingMethodAccessorImpl.invoke(DelegatingMethodAccessorImpl.java:43)
18-Jun-2019 08:14:14             at java.lang.reflect.Method.invoke(Method.java:498)
18-Jun-2019 08:14:14             at org.springframework.beans.factory.annotation.InitDestroyAnnotationBeanPostProcessor$LifecycleElement.invoke(InitDestroyAnnotationBeanPostProcessor.java:363)
18-Jun-2019 08:14:14             at org.springframework.beans.factory.annotation.InitDestroyAnnotationBeanPostProcessor$LifecycleMetadata.invokeInitMethods(InitDestroyAnnotationBeanPostProcessor.java:307)
18-Jun-2019 08:14:14             at org.springframework.beans.factory.annotation.InitDestroyAnnotationBeanPostProcessor.postProcessBeforeInitialization(InitDestroyAnnotationBeanPostProcessor.java:136)
18-Jun-2019 08:14:14             ... 93 common frames omitted
18-Jun-2019 08:14:14     Caused by: java.io.IOException: null
18-Jun-2019 08:14:14             at com.rabbitmq.client.impl.AMQChannel.wrap(AMQChannel.java:129)
18-Jun-2019 08:14:14             at com.rabbitmq.client.impl.AMQChannel.wrap(AMQChannel.java:125)
18-Jun-2019 08:14:14             at com.rabbitmq.client.impl.AMQChannel.exnWrappingRpc(AMQChannel.java:147)
18-Jun-2019 08:14:14             at com.rabbitmq.client.impl.ChannelN.queueDeclare(ChannelN.java:968)
18-Jun-2019 08:14:14             at com.rabbitmq.client.impl.ChannelN.queueDeclare(ChannelN.java:52)
18-Jun-2019 08:14:14             at sun.reflect.NativeMethodAccessorImpl.invoke0(Native Method)
18-Jun-2019 08:14:14             at sun.reflect.NativeMethodAccessorImpl.invoke(NativeMethodAccessorImpl.java:62)
18-Jun-2019 08:14:14             at sun.reflect.DelegatingMethodAccessorImpl.invoke(DelegatingMethodAccessorImpl.java:43)
18-Jun-2019 08:14:14             at java.lang.reflect.Method.invoke(Method.java:498)
18-Jun-2019 08:14:14             at org.springframework.amqp.rabbit.connection.CachingConnectionFactory$CachedChannelInvocationHandler.invoke(CachingConnectionFactory.java:1140)
18-Jun-2019 08:14:14             at com.sun.proxy.$Proxy48.queueDeclare(Unknown Source)
18-Jun-2019 08:14:14             at org.springframework.amqp.rabbit.core.RabbitAdmin.declareQueues(RabbitAdmin.java:710)
18-Jun-2019 08:14:14             at org.springframework.amqp.rabbit.core.RabbitAdmin.lambda$declareQueue$2(RabbitAdmin.java:278)
18-Jun-2019 08:14:14             at org.springframework.amqp.rabbit.core.RabbitTemplate.invokeAction(RabbitTemplate.java:2135)
18-Jun-2019 08:14:14             at org.springframework.amqp.rabbit.core.RabbitTemplate.doExecute(RabbitTemplate.java:2094)
18-Jun-2019 08:14:14             ... 104 common frames omitted
18-Jun-2019 08:14:14     Caused by: com.rabbitmq.client.ShutdownSignalException: channel error; protocol method: #method<channel.close>(reply-code=406, reply-text=PRECONDITION_FAILED - inequivalent arg 'durable' for queue 'reactor.rabbitmq.spring.boot' in vhost '/': received 'false' but current is 'true', class-id=50, method-id=10)
18-Jun-2019 08:14:14             at com.rabbitmq.utility.ValueOrException.getValue(ValueOrException.java:66)
18-Jun-2019 08:14:14             at com.rabbitmq.utility.BlockingValueOrException.uninterruptibleGetValue(BlockingValueOrException.java:36)
18-Jun-2019 08:14:14             at com.rabbitmq.client.impl.AMQChannel$BlockingRpcContinuation.getReply(AMQChannel.java:502)
18-Jun-2019 08:14:14             at com.rabbitmq.client.impl.AMQChannel.privateRpc(AMQChannel.java:293)
18-Jun-2019 08:14:14             at com.rabbitmq.client.impl.AMQChannel.exnWrappingRpc(AMQChannel.java:141)
18-Jun-2019 08:14:14             ... 116 common frames omitted
18-Jun-2019 08:14:14     Caused by: com.rabbitmq.client.ShutdownSignalException: channel error; protocol method: #method<channel.close>(reply-code=406, reply-text=PRECONDITION_FAILED - inequivalent arg 'durable' for queue 'reactor.rabbitmq.spring.boot' in vhost '/': received 'false' but current is 'true', class-id=50, method-id=10)
18-Jun-2019 08:14:14             at com.rabbitmq.client.impl.ChannelN.asyncShutdown(ChannelN.java:522)
18-Jun-2019 08:14:14             at com.rabbitmq.client.impl.ChannelN.processAsync(ChannelN.java:346)
18-Jun-2019 08:14:14             at com.rabbitmq.client.impl.AMQChannel.handleCompleteInboundCommand(AMQChannel.java:182)
18-Jun-2019 08:14:14             at com.rabbitmq.client.impl.AMQChannel.handleFrame(AMQChannel.java:114)
18-Jun-2019 08:14:14             at com.rabbitmq.client.impl.AMQConnection.readFrame(AMQConnection.java:672)
18-Jun-2019 08:14:14             at com.rabbitmq.client.impl.AMQConnection.access$300(AMQConnection.java:48)
18-Jun-2019 08:14:14             at com.rabbitmq.client.impl.AMQConnection$MainLoop.run(AMQConnection.java:599)
18-Jun-2019 08:14:14             ... 1 common frames omitted
18-Jun-2019 08:14:14
18-Jun-2019 08:14:14 Gradle Test Executor 2 finished executing tests.
18-Jun-2019 08:14:14
18-Jun-2019 08:14:14 > Task :reactor-rabbitmq-samples:test FAILED
18-Jun-2019 08:14:14
18-Jun-2019 08:14:14 reactor.rabbitmq.samples.SpringBootSampleTest > test() FAILED
18-Jun-2019 08:14:14     org.springframework.beans.factory.BeanCreationException: Error creating bean with name 'springBootSample': Invocation of init method failed; nested exception is org.springframework.amqp.AmqpIOException: java.io.IOException
18-Jun-2019 08:14:14         at org.springframework.beans.factory.annotation.InitDestroyAnnotationBeanPostProcessor.postProcessBeforeInitialization(InitDestroyAnnotationBeanPostProcessor.java:139)
18-Jun-2019 08:14:14         at org.springframework.beans.factory.support.AbstractAutowireCapableBeanFactory.applyBeanPostProcessorsBeforeInitialization(AbstractAutowireCapableBeanFactory.java:414)
18-Jun-2019 08:14:14         at org.springframework.beans.factory.support.AbstractAutowireCapableBeanFactory.initializeBean(AbstractAutowireCapableBeanFactory.java:1770)
18-Jun-2019 08:14:14         at org.springframework.beans.factory.support.AbstractAutowireCapableBeanFactory.doCreateBean(AbstractAutowireCapableBeanFactory.java:593)
18-Jun-2019 08:14:14         at org.springframework.beans.factory.support.AbstractAutowireCapableBeanFactory.createBean(AbstractAutowireCapableBeanFactory.java:515)
18-Jun-2019 08:14:14         at org.springframework.beans.factory.support.AbstractBeanFactory.lambda$doGetBean$0(AbstractBeanFactory.java:320)
18-Jun-2019 08:14:14         at org.springframework.beans.factory.support.DefaultSingletonBeanRegistry.getSingleton(DefaultSingletonBeanRegistry.java:222)
18-Jun-2019 08:14:14         at org.springframework.beans.factory.support.AbstractBeanFactory.doGetBean(AbstractBeanFactory.java:318)
18-Jun-2019 08:14:14         at org.springframework.beans.factory.support.AbstractBeanFactory.getBean(AbstractBeanFactory.java:199)
18-Jun-2019 08:14:14         at org.springframework.beans.factory.support.DefaultListableBeanFactory.preInstantiateSingletons(DefaultListableBeanFactory.java:845)
18-Jun-2019 08:14:14         at org.springframework.context.support.AbstractApplicationContext.finishBeanFactoryInitialization(AbstractApplicationContext.java:877)
18-Jun-2019 08:14:14         at org.springframework.context.support.AbstractApplicationContext.refresh(AbstractApplicationContext.java:549)
18-Jun-2019 08:14:14         at org.springframework.boot.SpringApplication.refresh(SpringApplication.java:775)
18-Jun-2019 08:14:14         at org.springframework.boot.SpringApplication.refreshContext(SpringApplication.java:397)
18-Jun-2019 08:14:14         at org.springframework.boot.SpringApplication.run(SpringApplication.java:316)
18-Jun-2019 08:14:14         at org.springframework.boot.SpringApplication.run(SpringApplication.java:1260)
18-Jun-2019 08:14:14         at org.springframework.boot.SpringApplication.run(SpringApplication.java:1248)
18-Jun-2019 08:14:14         at reactor.rabbitmq.samples.SpringBootSampleTest.test(SpringBootSampleTest.java:29)
18-Jun-2019 08:14:14
18-Jun-2019 08:14:14         Caused by:
18-Jun-2019 08:14:14         org.springframework.amqp.AmqpIOException: java.io.IOException
18-Jun-2019 08:14:14             at org.springframework.amqp.rabbit.support.RabbitExceptionTranslator.convertRabbitAccessException(RabbitExceptionTranslator.java:71)
18-Jun-2019 08:14:14             at org.springframework.amqp.rabbit.connection.RabbitAccessor.convertRabbitAccessException(RabbitAccessor.java:116)
18-Jun-2019 08:14:14             at org.springframework.amqp.rabbit.core.RabbitTemplate.doExecute(RabbitTemplate.java:2100)
18-Jun-2019 08:14:14             at org.springframework.amqp.rabbit.core.RabbitTemplate.execute(RabbitTemplate.java:2047)
18-Jun-2019 08:14:14             at org.springframework.amqp.rabbit.core.RabbitTemplate.execute(RabbitTemplate.java:2027)
18-Jun-2019 08:14:14             at org.springframework.amqp.rabbit.core.RabbitAdmin.declareQueue(RabbitAdmin.java:277)
18-Jun-2019 08:14:14             at reactor.rabbitmq.samples.SpringBootSample.init(SpringBootSample.java:86)
18-Jun-2019 08:14:14             at sun.reflect.NativeMethodAccessorImpl.invoke0(Native Method)
18-Jun-2019 08:14:14             at sun.reflect.NativeMethodAccessorImpl.invoke(NativeMethodAccessorImpl.java:62)
18-Jun-2019 08:14:14             at sun.reflect.DelegatingMethodAccessorImpl.invoke(DelegatingMethodAccessorImpl.java:43)
18-Jun-2019 08:14:14             at java.lang.reflect.Method.invoke(Method.java:498)
18-Jun-2019 08:14:14             at org.springframework.beans.factory.annotation.InitDestroyAnnotationBeanPostProcessor$LifecycleElement.invoke(InitDestroyAnnotationBeanPostProcessor.java:363)
18-Jun-2019 08:14:14             at org.springframework.beans.factory.annotation.InitDestroyAnnotationBeanPostProcessor$LifecycleMetadata.invokeInitMethods(InitDestroyAnnotationBeanPostProcessor.java:307)
18-Jun-2019 08:14:14             at org.springframework.beans.factory.annotation.InitDestroyAnnotationBeanPostProcessor.postProcessBeforeInitialization(InitDestroyAnnotationBeanPostProcessor.java:136)
18-Jun-2019 08:14:14             ... 17 more
18-Jun-2019 08:14:14
18-Jun-2019 08:14:14             Caused by:
18-Jun-2019 08:14:14             java.io.IOException
18-Jun-2019 08:14:14                 at com.rabbitmq.client.impl.AMQChannel.wrap(AMQChannel.java:129)
18-Jun-2019 08:14:14                 at com.rabbitmq.client.impl.AMQChannel.wrap(AMQChannel.java:125)
18-Jun-2019 08:14:14                 at com.rabbitmq.client.impl.AMQChannel.exnWrappingRpc(AMQChannel.java:147)
18-Jun-2019 08:14:14                 at com.rabbitmq.client.impl.ChannelN.queueDeclare(ChannelN.java:968)
18-Jun-2019 08:14:14                 at com.rabbitmq.client.impl.ChannelN.queueDeclare(ChannelN.java:52)
18-Jun-2019 08:14:14                 at sun.reflect.NativeMethodAccessorImpl.invoke0(Native Method)
18-Jun-2019 08:14:14                 at sun.reflect.NativeMethodAccessorImpl.invoke(NativeMethodAccessorImpl.java:62)
18-Jun-2019 08:14:14                 at sun.reflect.DelegatingMethodAccessorImpl.invoke(DelegatingMethodAccessorImpl.java:43)
18-Jun-2019 08:14:14                 at java.lang.reflect.Method.invoke(Method.java:498)
18-Jun-2019 08:14:14                 at org.springframework.amqp.rabbit.connection.CachingConnectionFactory$CachedChannelInvocationHandler.invoke(CachingConnectionFactory.java:1140)
18-Jun-2019 08:14:14                 at com.sun.proxy.$Proxy48.queueDeclare(Unknown Source)
18-Jun-2019 08:14:14                 at org.springframework.amqp.rabbit.core.RabbitAdmin.declareQueues(RabbitAdmin.java:710)
18-Jun-2019 08:14:14                 at org.springframework.amqp.rabbit.core.RabbitAdmin.lambda$declareQueue$2(RabbitAdmin.java:278)
18-Jun-2019 08:14:14                 at org.springframework.amqp.rabbit.core.RabbitTemplate.invokeAction(RabbitTemplate.java:2135)
18-Jun-2019 08:14:14                 at org.springframework.amqp.rabbit.core.RabbitTemplate.doExecute(RabbitTemplate.java:2094)
18-Jun-2019 08:14:14                 ... 28 more
18-Jun-2019 08:14:14
18-Jun-2019 08:14:14                 Caused by:
18-Jun-2019 08:14:14                 com.rabbitmq.client.ShutdownSignalException: channel error; protocol method: #method<channel.close>(reply-code=406, reply-text=PRECONDITION_FAILED - inequivalent arg 'durable' for queue 'reactor.rabbitmq.spring.boot' in vhost '/': received 'false' but current is 'true', class-id=50, method-id=10)
18-Jun-2019 08:14:14                     at com.rabbitmq.utility.ValueOrException.getValue(ValueOrException.java:66)
18-Jun-2019 08:14:14                     at com.rabbitmq.utility.BlockingValueOrException.uninterruptibleGetValue(BlockingValueOrException.java:36)
18-Jun-2019 08:14:14                     at com.rabbitmq.client.impl.AMQChannel$BlockingRpcContinuation.getReply(AMQChannel.java:502)
18-Jun-2019 08:14:14                     at com.rabbitmq.client.impl.AMQChannel.privateRpc(AMQChannel.java:293)
18-Jun-2019 08:14:14                     at com.rabbitmq.client.impl.AMQChannel.exnWrappingRpc(AMQChannel.java:141)
18-Jun-2019 08:14:14                     ... 40 more
18-Jun-2019 08:14:14
18-Jun-2019 08:14:14                     Caused by:
18-Jun-2019 08:14:14                     com.rabbitmq.client.ShutdownSignalException: channel error; protocol method: #method<channel.close>(reply-code=406, reply-text=PRECONDITION_FAILED - inequivalent arg 'durable' for queue 'reactor.rabbitmq.spring.boot' in vhost '/': received 'false' but current is 'true', class-id=50, method-id=10)
18-Jun-2019 08:14:14 Finished generating test XML results (0.004 secs) into: /opt/bamboo-home/xml-data/build-dir/REACTOR-REACTORRMQ-NETTY/reactor-rabbitmq-samples/build/test-results/test
18-Jun-2019 08:14:14 Generating HTML test report...
18-Jun-2019 08:14:14 Finished generating test html results (0.004 secs) into: /opt/bamboo-home/xml-data/build-dir/REACTOR-REACTORRMQ-NETTY/reactor-rabbitmq-samples/build/reports/tests/test
18-Jun-2019 08:14:14 :reactor-rabbitmq-samples:test (Thread[Execution worker for ':',5,main]) completed. Took 2.613 secs.
18-Jun-2019 08:14:14
18-Jun-2019 08:14:14 2 tests completed, 1 failed
18-Jun-2019 08:14:14
18-Jun-2019 08:14:14 FAILURE: Build failed with an exception.
18-Jun-2019 08:14:14
18-Jun-2019 08:14:14 * What went wrong:
18-Jun-2019 08:14:14 Execution failed for task ':reactor-rabbitmq-samples:test'.
18-Jun-2019 08:14:14 > There were failing tests. See the report at: file:///opt/bamboo-home/xml-data/build-dir/REACTOR-REACTORRMQ-NETTY/reactor-rabbitmq-samples/build/reports/tests/test/index.html
18-Jun-2019 08:14:14
18-Jun-2019 08:14:14 * Try:
18-Jun-2019 08:14:14 Run with --debug option to get more log output. Run with --scan to get full insights.
18-Jun-2019 08:14:14
18-Jun-2019 08:14:14 * Exception is:
18-Jun-2019 08:14:14 org.gradle.api.tasks.TaskExecutionException: Execution failed for task ':reactor-rabbitmq-samples:test'.
18-Jun-2019 08:14:14         at org.gradle.api.internal.tasks.execution.ExecuteActionsTaskExecuter$3.accept(ExecuteActionsTaskExecuter.java:151)
18-Jun-2019 08:14:14         at org.gradle.api.internal.tasks.execution.ExecuteActionsTaskExecuter$3.accept(ExecuteActionsTaskExecuter.java:148)
18-Jun-2019 08:14:14         at org.gradle.internal.Try$Failure.ifSuccessfulOrElse(Try.java:191)
18-Jun-2019 08:14:14         at org.gradle.api.internal.tasks.execution.ExecuteActionsTaskExecuter.execute(ExecuteActionsTaskExecuter.java:141)
18-Jun-2019 08:14:14         at org.gradle.api.internal.tasks.execution.ResolveBeforeExecutionStateTaskExecuter.execute(ResolveBeforeExecutionStateTaskExecuter.java:75)
18-Jun-2019 08:14:14         at org.gradle.api.internal.tasks.execution.ValidatingTaskExecuter.execute(ValidatingTaskExecuter.java:62)
18-Jun-2019 08:14:14         at org.gradle.api.internal.tasks.execution.SkipEmptySourceFilesTaskExecuter.execute(SkipEmptySourceFilesTaskExecuter.java:108)
18-Jun-2019 08:14:14         at org.gradle.api.internal.tasks.execution.ResolveBeforeExecutionOutputsTaskExecuter.execute(ResolveBeforeExecutionOutputsTaskExecuter.java:67)
18-Jun-2019 08:14:14         at org.gradle.api.internal.tasks.execution.ResolveAfterPreviousExecutionStateTaskExecuter.execute(ResolveAfterPreviousExecutionStateTaskExecuter.java:46)
18-Jun-2019 08:14:14         at org.gradle.api.internal.tasks.execution.CleanupStaleOutputsExecuter.execute(CleanupStaleOutputsExecuter.java:94)
18-Jun-2019 08:14:14         at org.gradle.api.internal.tasks.execution.FinalizePropertiesTaskExecuter.execute(FinalizePropertiesTaskExecuter.java:46)
18-Jun-2019 08:14:14         at org.gradle.api.internal.tasks.execution.ResolveTaskExecutionModeExecuter.execute(ResolveTaskExecutionModeExecuter.java:95)
18-Jun-2019 08:14:14         at org.gradle.api.internal.tasks.execution.SkipTaskWithNoActionsExecuter.execute(SkipTaskWithNoActionsExecuter.java:57)
18-Jun-2019 08:14:14         at org.gradle.api.internal.tasks.execution.SkipOnlyIfTaskExecuter.execute(SkipOnlyIfTaskExecuter.java:56)
18-Jun-2019 08:14:14         at org.gradle.api.internal.tasks.execution.CatchExceptionTaskExecuter.execute(CatchExceptionTaskExecuter.java:36)
18-Jun-2019 08:14:14         at org.gradle.api.internal.tasks.execution.EventFiringTaskExecuter$1.executeTask(EventFiringTaskExecuter.java:73)
18-Jun-2019 08:14:14         at org.gradle.api.internal.tasks.execution.EventFiringTaskExecuter$1.call(EventFiringTaskExecuter.java:52)
18-Jun-2019 08:14:14         at org.gradle.api.internal.tasks.execution.EventFiringTaskExecuter$1.call(EventFiringTaskExecuter.java:49)
18-Jun-2019 08:14:14         at org.gradle.internal.operations.DefaultBuildOperationExecutor$CallableBuildOperationWorker.execute(DefaultBuildOperationExecutor.java:416)
18-Jun-2019 08:14:14         at org.gradle.internal.operations.DefaultBuildOperationExecutor$CallableBuildOperationWorker.execute(DefaultBuildOperationExecutor.java:406)
18-Jun-2019 08:14:14         at org.gradle.internal.operations.DefaultBuildOperationExecutor$1.execute(DefaultBuildOperationExecutor.java:165)
18-Jun-2019 08:14:14         at org.gradle.internal.operations.DefaultBuildOperationExecutor.execute(DefaultBuildOperationExecutor.java:250)
18-Jun-2019 08:14:14         at org.gradle.internal.operations.DefaultBuildOperationExecutor.execute(DefaultBuildOperationExecutor.java:158)
18-Jun-2019 08:14:14         at org.gradle.internal.operations.DefaultBuildOperationExecutor.call(DefaultBuildOperationExecutor.java:102)
18-Jun-2019 08:14:14         at org.gradle.internal.operations.DelegatingBuildOperationExecutor.call(DelegatingBuildOperationExecutor.java:36)
18-Jun-2019 08:14:14         at org.gradle.api.internal.tasks.execution.EventFiringTaskExecuter.execute(EventFiringTaskExecuter.java:49)
18-Jun-2019 08:14:14         at org.gradle.execution.plan.LocalTaskNodeExecutor.execute(LocalTaskNodeExecutor.java:43)
18-Jun-2019 08:14:14         at org.gradle.execution.taskgraph.DefaultTaskExecutionGraph$InvokeNodeExecutorsAction.execute(DefaultTaskExecutionGraph.java:355)
18-Jun-2019 08:14:14         at org.gradle.execution.taskgraph.DefaultTaskExecutionGraph$InvokeNodeExecutorsAction.execute(DefaultTaskExecutionGraph.java:343)
18-Jun-2019 08:14:14         at org.gradle.execution.taskgraph.DefaultTaskExecutionGraph$BuildOperationAwareExecutionAction.execute(DefaultTaskExecutionGraph.java:336)
18-Jun-2019 08:14:14         at org.gradle.execution.taskgraph.DefaultTaskExecutionGraph$BuildOperationAwareExecutionAction.execute(DefaultTaskExecutionGraph.java:322)
18-Jun-2019 08:14:14         at org.gradle.execution.plan.DefaultPlanExecutor$ExecutorWorker$1.execute(DefaultPlanExecutor.java:134)
18-Jun-2019 08:14:14         at org.gradle.execution.plan.DefaultPlanExecutor$ExecutorWorker$1.execute(DefaultPlanExecutor.java:129)
18-Jun-2019 08:14:14         at org.gradle.execution.plan.DefaultPlanExecutor$ExecutorWorker.execute(DefaultPlanExecutor.java:202)
18-Jun-2019 08:14:14         at org.gradle.execution.plan.DefaultPlanExecutor$ExecutorWorker.executeNextNode(DefaultPlanExecutor.java:193)
18-Jun-2019 08:14:14         at org.gradle.execution.plan.DefaultPlanExecutor$ExecutorWorker.run(DefaultPlanExecutor.java:129)
18-Jun-2019 08:14:14         at org.gradle.internal.concurrent.ExecutorPolicy$CatchAndRecordFailures.onExecute(ExecutorPolicy.java:63)
18-Jun-2019 08:14:14         at org.gradle.internal.concurrent.ManagedExecutorImpl$1.run(ManagedExecutorImpl.java:46)
18-Jun-2019 08:14:14         at org.gradle.internal.concurrent.ThreadFactoryImpl$ManagedThreadRunnable.run(ThreadFactoryImpl.java:55)
18-Jun-2019 08:14:14 Caused by: org.gradle.api.GradleException: There were failing tests. See the report at: file:///opt/bamboo-home/xml-data/build-dir/REACTOR-REACTORRMQ-NETTY/reactor-rabbitmq-samples/build/reports/tests/test/index.html
18-Jun-2019 08:14:14         at org.gradle.api.tasks.testing.AbstractTestTask.handleTestFailures(AbstractTestTask.java:626)
18-Jun-2019 08:14:14         at org.gradle.api.tasks.testing.AbstractTestTask.executeTests(AbstractTestTask.java:498)
18-Jun-2019 08:14:14
18-Jun-2019 08:14:14 Deprecated Gradle features were used in this build, making it incompatible with Gradle 6.0.
18-Jun-2019 08:14:14         at org.gradle.api.tasks.testing.Test.executeTests(Test.java:594)
18-Jun-2019 08:14:14 Use '--warning-mode all' to show the individual deprecation warnings.
18-Jun-2019 08:14:14 See https://docs.gradle.org/5.4/userguide/command_line_interface.html#sec:command_line_warnings
18-Jun-2019 08:14:14         at org.gradle.internal.reflect.JavaMethod.invoke(JavaMethod.java:103)
18-Jun-2019 08:14:14         at org.gradle.api.internal.project.taskfactory.StandardTaskAction.doExecute(StandardTaskAction.java:48)
18-Jun-2019 08:14:14 12 actionable tasks: 10 executed, 2 up-to-date
18-Jun-2019 08:14:14         at org.gradle.api.internal.project.taskfactory.StandardTaskAction.execute(StandardTaskAction.java:41)
18-Jun-2019 08:14:14         at org.gradle.api.internal.project.taskfactory.StandardTaskAction.execute(StandardTaskAction.java:28)
18-Jun-2019 08:14:14         at org.gradle.api.internal.AbstractTask$TaskActionWrapper.execute(AbstractTask.java:702)
18-Jun-2019 08:14:14         at org.gradle.api.internal.AbstractTask$TaskActionWrapper.execute(AbstractTask.java:669)
18-Jun-2019 08:14:14         at org.gradle.api.internal.tasks.execution.ExecuteActionsTaskExecuter$5.run(ExecuteActionsTaskExecuter.java:404)
18-Jun-2019 08:14:14         at org.gradle.internal.operations.DefaultBuildOperationExecutor$RunnableBuildOperationWorker.execute(DefaultBuildOperationExecutor.java:402)
18-Jun-2019 08:14:14         at org.gradle.internal.operations.DefaultBuildOperationExecutor$RunnableBuildOperationWorker.execute(DefaultBuildOperationExecutor.java:394)
18-Jun-2019 08:14:14         at org.gradle.internal.operations.DefaultBuildOperationExecutor$1.execute(DefaultBuildOperationExecutor.java:165)
18-Jun-2019 08:14:14         at org.gradle.internal.operations.DefaultBuildOperationExecutor.execute(DefaultBuildOperationExecutor.java:250)
18-Jun-2019 08:14:14         at org.gradle.internal.operations.DefaultBuildOperationExecutor.execute(DefaultBuildOperationExecutor.java:158)
18-Jun-2019 08:14:14         at org.gradle.internal.operations.DefaultBuildOperationExecutor.run(DefaultBuildOperationExecutor.java:92)
18-Jun-2019 08:14:14         at org.gradle.internal.operations.DelegatingBuildOperationExecutor.run(DelegatingBuildOperationExecutor.java:31)
18-Jun-2019 08:14:14         at org.gradle.api.internal.tasks.execution.ExecuteActionsTaskExecuter.executeAction(ExecuteActionsTaskExecuter.java:393)
18-Jun-2019 08:14:14         at org.gradle.api.internal.tasks.execution.ExecuteActionsTaskExecuter.executeActions(ExecuteActionsTaskExecuter.java:376)
18-Jun-2019 08:14:14         at org.gradle.api.internal.tasks.execution.ExecuteActionsTaskExecuter.access$200(ExecuteActionsTaskExecuter.java:80)
18-Jun-2019 08:14:14         at org.gradle.api.internal.tasks.execution.ExecuteActionsTaskExecuter$TaskExecution.execute(ExecuteActionsTaskExecuter.java:213)
18-Jun-2019 08:14:14         at org.gradle.internal.execution.steps.ExecuteStep.lambda$execute$1(ExecuteStep.java:33)
18-Jun-2019 08:14:14         at org.gradle.internal.execution.steps.ExecuteStep.execute(ExecuteStep.java:33)
18-Jun-2019 08:14:14         at org.gradle.internal.execution.steps.ExecuteStep.execute(ExecuteStep.java:26)
18-Jun-2019 08:14:14         at org.gradle.internal.execution.steps.CleanupOutputsStep.execute(CleanupOutputsStep.java:58)
18-Jun-2019 08:14:14         at org.gradle.internal.execution.steps.CleanupOutputsStep.execute(CleanupOutputsStep.java:35)
18-Jun-2019 08:14:14         at org.gradle.internal.execution.steps.ResolveInputChangesStep.execute(ResolveInputChangesStep.java:48)
18-Jun-2019 08:14:14         at org.gradle.internal.execution.steps.ResolveInputChangesStep.execute(ResolveInputChangesStep.java:33)
18-Jun-2019 08:14:14         at org.gradle.internal.execution.steps.CancelExecutionStep.execute(CancelExecutionStep.java:39)
18-Jun-2019 08:14:14         at org.gradle.internal.execution.steps.TimeoutStep.executeWithoutTimeout(TimeoutStep.java:73)
18-Jun-2019 08:14:14         at org.gradle.internal.execution.steps.TimeoutStep.execute(TimeoutStep.java:54)
18-Jun-2019 08:14:14         at org.gradle.internal.execution.steps.CatchExceptionStep.execute(CatchExceptionStep.java:35)
18-Jun-2019 08:14:14         at org.gradle.internal.execution.steps.CreateOutputsStep.execute(CreateOutputsStep.java:51)
18-Jun-2019 08:14:14         at org.gradle.internal.execution.steps.SnapshotOutputsStep.execute(SnapshotOutputsStep.java:45)
18-Jun-2019 08:14:14         at org.gradle.internal.execution.steps.SnapshotOutputsStep.execute(SnapshotOutputsStep.java:31)
18-Jun-2019 08:14:14         at org.gradle.internal.execution.steps.CacheStep.executeWithoutCache(CacheStep.java:201)
18-Jun-2019 08:14:14         at org.gradle.internal.execution.steps.CacheStep.execute(CacheStep.java:70)
18-Jun-2019 08:14:14         at org.gradle.internal.execution.steps.CacheStep.execute(CacheStep.java:45)
18-Jun-2019 08:14:14         at org.gradle.internal.execution.steps.BroadcastChangingOutputsStep.execute(BroadcastChangingOutputsStep.java:49)
18-Jun-2019 08:14:14         at org.gradle.internal.execution.steps.StoreSnapshotsStep.execute(StoreSnapshotsStep.java:43)
18-Jun-2019 08:14:14         at org.gradle.internal.execution.steps.StoreSnapshotsStep.execute(StoreSnapshotsStep.java:32)
18-Jun-2019 08:14:14         at org.gradle.internal.execution.steps.RecordOutputsStep.execute(RecordOutputsStep.java:38)
18-Jun-2019 08:14:14         at org.gradle.internal.execution.steps.RecordOutputsStep.execute(RecordOutputsStep.java:24)
18-Jun-2019 08:14:14         at org.gradle.internal.execution.steps.SkipUpToDateStep.executeBecause(SkipUpToDateStep.java:96)
18-Jun-2019 08:14:14         at org.gradle.internal.execution.steps.SkipUpToDateStep.lambda$execute$0(SkipUpToDateStep.java:89)
18-Jun-2019 08:14:14         at org.gradle.internal.execution.steps.SkipUpToDateStep.execute(SkipUpToDateStep.java:54)
18-Jun-2019 08:14:14         at org.gradle.internal.execution.steps.SkipUpToDateStep.execute(SkipUpToDateStep.java:38)
18-Jun-2019 08:14:14         at org.gradle.internal.execution.steps.ResolveChangesStep.execute(ResolveChangesStep.java:77)
18-Jun-2019 08:14:14         at org.gradle.internal.execution.steps.ResolveChangesStep.execute(ResolveChangesStep.java:37)
18-Jun-2019 08:14:14         at org.gradle.internal.execution.steps.legacy.MarkSnapshottingInputsFinishedStep.execute(MarkSnapshottingInputsFinishedStep.java:36)
18-Jun-2019 08:14:14         at org.gradle.internal.execution.steps.legacy.MarkSnapshottingInputsFinishedStep.execute(MarkSnapshottingInputsFinishedStep.java:26)
18-Jun-2019 08:14:14         at org.gradle.internal.execution.steps.ResolveCachingStateStep.execute(ResolveCachingStateStep.java:90)
18-Jun-2019 08:14:14         at org.gradle.internal.execution.steps.ResolveCachingStateStep.execute(ResolveCachingStateStep.java:48)
18-Jun-2019 08:14:14         at org.gradle.internal.execution.impl.DefaultWorkExecutor.execute(DefaultWorkExecutor.java:33)
18-Jun-2019 08:14:14         at org.gradle.api.internal.tasks.execution.ExecuteActionsTaskExecuter.execute(ExecuteActionsTaskExecuter.java:120)
18-Jun-2019 08:14:14         ... 35 more
18-Jun-2019 08:14:14
18-Jun-2019 08:14:14
18-Jun-2019 08:14:14 * Get more help at https://help.gradle.org
18-Jun-2019 08:14:14
18-Jun-2019 08:14:14 BUILD FAILED in 42s
18-Jun-2019 08:14:15
18-Jun-2019 08:14:15 Failing task since return code of [./gradlew --stacktrace --no-daemon --info clean test assemble -I /tmp/artifactory.init.script2213363525060616795gradle -DbuildInfoConfig.propertiesFile=/tmp/buildinfo3222494120824442788properties artifactoryPublish -Dartifactory.resolve.password=******** -Dartifactory.publish.password=********] was 1 while expected 0
18-Jun-2019 08:14:15 Parsing test results under /opt/bamboo-home/xml-data/build-dir/REACTOR-REACTORRMQ-NETTY...
18-Jun-2019 08:14:15 Finished task 'Build Test Assemble' with result: Failed
18-Jun-2019 08:14:15 Running post build plugin 'Docker Container Cleanup'
18-Jun-2019 08:14:15 Running post build plugin 'NCover Results Collector'
18-Jun-2019 08:14:15 Running post build plugin 'Artifactory Release Management Staging'
18-Jun-2019 08:14:15 Running post build plugin 'Artifactory Build Info Copier'
18-Jun-2019 08:14:15 Running post build plugin 'Artifactory Gradle Properties Info Copier'
18-Jun-2019 08:14:15 Running post build plugin 'Clover Results Collector'
18-Jun-2019 08:14:15 Running post build plugin 'npm Cache Cleanup'
18-Jun-2019 08:14:15 Running post build plugin 'Artifact Copier'
18-Jun-2019 08:14:15 Publishing an artifact: test-report
18-Jun-2019 08:14:15 Finished publishing of artifact Non required job artifact: [test-report], pattern: [**/build/reports/tests/**] in 22.26 ms
18-Jun-2019 08:14:15 Successfully removed working directory at '/opt/bamboo-home/xml-data/build-dir/REACTOR-REACTORRMQ-NETTY'
18-Jun-2019 08:14:15 Finalising the build...
18-Jun-2019 08:14:15 Stopping timer.
18-Jun-2019 08:14:15 Build REACTOR-REACTORRMQ-NETTY-300 completed.
18-Jun-2019 08:14:15 Running on server: post build plugin 'NCover Results Collector'
18-Jun-2019 08:14:15 Running on server: post build plugin 'Build Hanging Detection Configuration'
18-Jun-2019 08:14:15 Running on server: post build plugin 'Clover Delta Calculator'
18-Jun-2019 08:14:15 Running on server: post build plugin 'Maven Dependencies Postprocessor'
18-Jun-2019 08:14:15 All post build plugins have finished
18-Jun-2019 08:14:15 Generating build results summary...
18-Jun-2019 08:14:15 Saving build results to disk...
18-Jun-2019 08:14:15 Logging substituted variables...
18-Jun-2019 08:14:15 Indexing build results...
18-Jun-2019 08:14:15 Finished building REACTOR-REACTORRMQ-NETTY-300.