Build: #777 failed Changes by Stephane Maldini <smaldini@pivotal.io>

Build result summary

Details

Completed
Duration
7 minutes
Labels
None
Agent
bamboo-13.af.pivotal.io
Revision
3bd196219f7c7262725b94355e31abce7592b79b 3bd196219f7c7262725b94355e31abce7592b79b
Total tests
139

Responsible

No one has taken responsibility for this failure

Code commits

Author Commit Message Commit date
Stephane Maldini <smaldini@pivotal.io> Stephane Maldini <smaldini@pivotal.io> 3bd196219f7c7262725b94355e31abce7592b79b 3bd196219f7c7262725b94355e31abce7592b79b Update to RS 1.0.2

Configuration changes

Plan configuration has changed since the last successful build. See the plan audit log for more details.

Tests

New test failures 1
Status Test View job Duration
Collapse Failed MockReceiverTest backPressureReceive History
Kafka < 1 sec
java.lang.AssertionError: java.lang.AssertionError: expected:<2> but was:<3>
java.lang.AssertionError: expected:<2> but was:<3>
	at org.junit.Assert.fail(Assert.java:88)
	at org.junit.Assert.failNotEquals(Assert.java:834)
	at org.junit.Assert.assertEquals(Assert.java:645)
	at org.junit.Assert.assertEquals(Assert.java:631)
	at reactor.kafka.receiver.internals.MockReceiverTest.lambda$testBackPressure$68(MockReceiverTest.java:1090)
	at reactor.test.DefaultStepVerifierBuilder$TaskEvent.run(DefaultStepVerifierBuilder.java:1988)
(50 more lines...)