Build #869

Build: #869 failed Changes by Sergei Egorov

Build result summary

Details

Completed
Duration
6 minutes
Labels
None
Agent
bamboo-22.af.pivotal.io
Revision
2cc44ba376fe1bf056fd68bd0c0580d86b9e0a1d 2cc44ba376fe1bf056fd68bd0c0580d86b9e0a1d
Total tests
169

Tests

Responsible

Code commits

Author Commit Message Commit date
Sergei Egorov Sergei Egorov 2cc44ba376fe1bf056fd68bd0c0580d86b9e0a1d 2cc44ba376fe1bf056fd68bd0c0580d86b9e0a1d Do not block when disposing the event loop (#151)

Tests

New test failures 1
Status Test View job Duration
Collapse Failed ConsumerPerformanceTest performanceRegressionTest History
Kafka 10 secs
java.lang.AssertionError: java.lang.AssertionError: Reactive throughput is lower than expected, reactive=1300390.1170351105, nonReactive=3090234.8578491965
java.lang.AssertionError: Reactive throughput is lower than expected, reactive=1300390.1170351105, nonReactive=3090234.8578491965
	at org.junit.Assert.fail(Assert.java:88)
	at org.junit.Assert.assertTrue(Assert.java:41)
	at reactor.kafka.tools.util.PerfTestUtils.verifyReactiveThroughput(PerfTestUtils.java:30)
	at reactor.kafka.tools.perf.ConsumerPerformanceTest.performanceRegressionTest(ConsumerPerformanceTest.java:61)
	at sun.reflect.NativeMethodAccessorImpl.invoke0(Native Method)
	at sun.reflect.NativeMethodAccessorImpl.invoke(NativeMethodAccessorImpl.java:62)
(48 more lines...)