Build #869

Build: #869 failed Changes by Sergei Egorov

Test results

  • 169 tests in total
  • 1 test failed
  • 1 failure is new
  • 8 tests were quarantined / skipped
  • 6 minutes taken in total.
New test failures 1
Status Test View job Duration
Collapse Failed ConsumerPerformanceTest performanceRegressionTest History
Kafka 10 secs
java.lang.AssertionError: java.lang.AssertionError: Reactive throughput is lower than expected, reactive=1300390.1170351105, nonReactive=3090234.8578491965
java.lang.AssertionError: Reactive throughput is lower than expected, reactive=1300390.1170351105, nonReactive=3090234.8578491965
	at org.junit.Assert.fail(Assert.java:88)
	at org.junit.Assert.assertTrue(Assert.java:41)
	at reactor.kafka.tools.util.PerfTestUtils.verifyReactiveThroughput(PerfTestUtils.java:30)
	at reactor.kafka.tools.perf.ConsumerPerformanceTest.performanceRegressionTest(ConsumerPerformanceTest.java:61)
	at sun.reflect.NativeMethodAccessorImpl.invoke0(Native Method)
	at sun.reflect.NativeMethodAccessorImpl.invoke(NativeMethodAccessorImpl.java:62)
(48 more lines...)
Skipped tests 8
Status Test Failing since View job
Skipped KafkaReceiverTest brokerRestart History
Kafka
Skipped KafkaReceiverTest autoAckPollWithIntervalWillNotFailOnOverflow History
Kafka
Skipped KafkaSenderTest idempotentSender History
Kafka
Skipped KafkaSenderTest sendResume History
Kafka
Skipped KafkaSenderTest sendStopOnError History
Kafka
Skipped KafkaSenderTest sendDontStopOnError History
Kafka
Skipped KafkaSenderTest sendChainFailure History
Kafka
Skipped KafkaSenderTest sendNoResponseFailure History
Kafka