Build #869

Build: #869 failed

Job: Kafka failed

Stages & jobs

  1. Default Stage

Build log

The build generated 1,099 lines of output.The output is too long and has been truncated to the last 1,000 lines. Download or view full build log

20-May-2020 09:48:34 remote: Counting objects:  79% (99/125)       
20-May-2020 09:48:34 remote: Counting objects:  80% (100/125)       
20-May-2020 09:48:34 remote: Counting objects:  81% (102/125)       
20-May-2020 09:48:34 remote: Counting objects:  82% (103/125)       
20-May-2020 09:48:34 remote: Counting objects:  83% (104/125)       
20-May-2020 09:48:34 remote: Counting objects:  84% (105/125)       
20-May-2020 09:48:34 remote: Counting objects:  85% (107/125)       
20-May-2020 09:48:34 remote: Counting objects:  86% (108/125)       
20-May-2020 09:48:34 remote: Counting objects:  87% (109/125)       
20-May-2020 09:48:34 remote: Counting objects:  88% (110/125)       
20-May-2020 09:48:34 remote: Counting objects:  89% (112/125)       
20-May-2020 09:48:34 remote: Counting objects:  90% (113/125)       
20-May-2020 09:48:34 remote: Counting objects:  91% (114/125)       
20-May-2020 09:48:34 remote: Counting objects:  92% (115/125)       
20-May-2020 09:48:34 remote: Counting objects:  93% (117/125)       
20-May-2020 09:48:34 remote: Counting objects:  94% (118/125)       
20-May-2020 09:48:34 remote: Counting objects:  95% (119/125)       
20-May-2020 09:48:34 remote: Counting objects:  96% (120/125)       
20-May-2020 09:48:34 remote: Counting objects:  97% (122/125)       
20-May-2020 09:48:34 remote: Counting objects:  98% (123/125)       
20-May-2020 09:48:34 remote: Counting objects:  99% (124/125)       
20-May-2020 09:48:34 remote: Counting objects: 100% (125/125)       
20-May-2020 09:48:34 remote: Counting objects: 100% (125/125), done.       
20-May-2020 09:48:34 remote: Compressing objects:   1% (1/79)       
20-May-2020 09:48:34 remote: Compressing objects:   2% (2/79)       
20-May-2020 09:48:34 remote: Compressing objects:   3% (3/79)       
20-May-2020 09:48:34 remote: Compressing objects:   5% (4/79)       
20-May-2020 09:48:34 remote: Compressing objects:   6% (5/79)       
20-May-2020 09:48:34 remote: Compressing objects:   7% (6/79)       
20-May-2020 09:48:34 remote: Compressing objects:   8% (7/79)       
20-May-2020 09:48:34 remote: Compressing objects:  10% (8/79)       
20-May-2020 09:48:34 remote: Compressing objects:  11% (9/79)       
20-May-2020 09:48:34 remote: Compressing objects:  12% (10/79)       
20-May-2020 09:48:34 remote: Compressing objects:  13% (11/79)       
20-May-2020 09:48:34 remote: Compressing objects:  15% (12/79)       
20-May-2020 09:48:34 remote: Compressing objects:  16% (13/79)       
20-May-2020 09:48:34 remote: Compressing objects:  17% (14/79)       
20-May-2020 09:48:34 remote: Compressing objects:  18% (15/79)       
20-May-2020 09:48:34 remote: Compressing objects:  20% (16/79)       
20-May-2020 09:48:34 remote: Compressing objects:  21% (17/79)       
20-May-2020 09:48:34 remote: Compressing objects:  22% (18/79)       
20-May-2020 09:48:34 remote: Compressing objects:  24% (19/79)       
20-May-2020 09:48:34 remote: Compressing objects:  25% (20/79)       
20-May-2020 09:48:34 remote: Compressing objects:  26% (21/79)       
20-May-2020 09:48:34 remote: Compressing objects:  27% (22/79)       
20-May-2020 09:48:34 remote: Compressing objects:  29% (23/79)       
20-May-2020 09:48:34 remote: Compressing objects:  30% (24/79)       
20-May-2020 09:48:34 remote: Compressing objects:  31% (25/79)       
20-May-2020 09:48:34 remote: Compressing objects:  32% (26/79)       
20-May-2020 09:48:34 remote: Compressing objects:  34% (27/79)       
20-May-2020 09:48:34 remote: Compressing objects:  35% (28/79)       
20-May-2020 09:48:34 remote: Compressing objects:  36% (29/79)       
20-May-2020 09:48:34 remote: Compressing objects:  37% (30/79)       
20-May-2020 09:48:34 remote: Compressing objects:  39% (31/79)       
20-May-2020 09:48:34 remote: Compressing objects:  40% (32/79)       
20-May-2020 09:48:34 remote: Compressing objects:  41% (33/79)       
20-May-2020 09:48:34 remote: Compressing objects:  43% (34/79)       
20-May-2020 09:48:34 remote: Compressing objects:  44% (35/79)       
20-May-2020 09:48:34 remote: Compressing objects:  45% (36/79)       
20-May-2020 09:48:34 remote: Compressing objects:  46% (37/79)       
20-May-2020 09:48:34 remote: Compressing objects:  48% (38/79)       
20-May-2020 09:48:34 remote: Compressing objects:  49% (39/79)       
20-May-2020 09:48:34 remote: Compressing objects:  50% (40/79)       
20-May-2020 09:48:34 remote: Compressing objects:  51% (41/79)       
20-May-2020 09:48:34 remote: Compressing objects:  53% (42/79)       
20-May-2020 09:48:34 remote: Compressing objects:  54% (43/79)       
20-May-2020 09:48:34 remote: Compressing objects:  55% (44/79)       
20-May-2020 09:48:34 remote: Compressing objects:  56% (45/79)       
20-May-2020 09:48:34 remote: Compressing objects:  58% (46/79)       
20-May-2020 09:48:34 remote: Compressing objects:  59% (47/79)       
20-May-2020 09:48:34 remote: Compressing objects:  60% (48/79)       
20-May-2020 09:48:34 remote: Compressing objects:  62% (49/79)       
20-May-2020 09:48:34 remote: Compressing objects:  63% (50/79)       
20-May-2020 09:48:34 remote: Compressing objects:  64% (51/79)       
20-May-2020 09:48:34 remote: Compressing objects:  65% (52/79)       
20-May-2020 09:48:34 remote: Compressing objects:  67% (53/79)       
20-May-2020 09:48:34 remote: Compressing objects:  68% (54/79)       
20-May-2020 09:48:34 remote: Compressing objects:  69% (55/79)       
20-May-2020 09:48:34 remote: Compressing objects:  70% (56/79)       
20-May-2020 09:48:34 remote: Compressing objects:  72% (57/79)       
20-May-2020 09:48:34 remote: Compressing objects:  73% (58/79)       
20-May-2020 09:48:34 remote: Compressing objects:  74% (59/79)       
20-May-2020 09:48:34 remote: Compressing objects:  75% (60/79)       
20-May-2020 09:48:34 remote: Compressing objects:  77% (61/79)       
20-May-2020 09:48:34 remote: Compressing objects:  78% (62/79)       
20-May-2020 09:48:34 remote: Compressing objects:  79% (63/79)       
20-May-2020 09:48:34 remote: Compressing objects:  81% (64/79)       
20-May-2020 09:48:34 remote: Compressing objects:  82% (65/79)       
20-May-2020 09:48:34 remote: Compressing objects:  83% (66/79)       
20-May-2020 09:48:34 remote: Compressing objects:  84% (67/79)       
20-May-2020 09:48:34 remote: Compressing objects:  86% (68/79)       
20-May-2020 09:48:34 remote: Compressing objects:  87% (69/79)       
20-May-2020 09:48:34 remote: Compressing objects:  88% (70/79)       
20-May-2020 09:48:34 remote: Compressing objects:  89% (71/79)       
20-May-2020 09:48:34 remote: Compressing objects:  91% (72/79)       
20-May-2020 09:48:34 remote: Compressing objects:  92% (73/79)       
20-May-2020 09:48:34 remote: Compressing objects:  93% (74/79)       
20-May-2020 09:48:34 remote: Compressing objects:  94% (75/79)       
20-May-2020 09:48:34 remote: Compressing objects:  96% (76/79)       
20-May-2020 09:48:34 remote: Compressing objects:  97% (77/79)       
20-May-2020 09:48:34 remote: Compressing objects:  98% (78/79)       
20-May-2020 09:48:34 remote: Compressing objects: 100% (79/79)       
20-May-2020 09:48:34 remote: Compressing objects: 100% (79/79), done.       
20-May-2020 09:48:34 Receiving objects:   0% (1/3680)   
20-May-2020 09:48:34 Receiving objects:   1% (37/3680)   
20-May-2020 09:48:34 Receiving objects:   2% (74/3680)   
20-May-2020 09:48:34 Receiving objects:   3% (111/3680)   
20-May-2020 09:48:34 Receiving objects:   4% (148/3680)   
20-May-2020 09:48:34 Receiving objects:   5% (184/3680)   
20-May-2020 09:48:34 Receiving objects:   6% (221/3680)   
20-May-2020 09:48:34 Receiving objects:   7% (258/3680)   
20-May-2020 09:48:35 Receiving objects:   8% (295/3680)   
20-May-2020 09:48:35 Receiving objects:   9% (332/3680)   
20-May-2020 09:48:35 Receiving objects:  10% (368/3680)   
20-May-2020 09:48:35 Receiving objects:  11% (405/3680)   
20-May-2020 09:48:35 Receiving objects:  12% (442/3680)   
20-May-2020 09:48:35 Receiving objects:  13% (479/3680)   
20-May-2020 09:48:35 Receiving objects:  14% (516/3680)   
20-May-2020 09:48:35 Receiving objects:  15% (552/3680)   
20-May-2020 09:48:35 Receiving objects:  16% (589/3680)   
20-May-2020 09:48:35 Receiving objects:  17% (626/3680)   
20-May-2020 09:48:35 Receiving objects:  18% (663/3680)   
20-May-2020 09:48:35 Receiving objects:  19% (700/3680)   
20-May-2020 09:48:35 Receiving objects:  20% (736/3680)   
20-May-2020 09:48:35 Receiving objects:  21% (773/3680)   
20-May-2020 09:48:35 Receiving objects:  22% (810/3680)   
20-May-2020 09:48:35 Receiving objects:  23% (847/3680)   
20-May-2020 09:48:35 Receiving objects:  24% (884/3680)   
20-May-2020 09:48:35 Receiving objects:  25% (920/3680)   
20-May-2020 09:48:35 Receiving objects:  26% (957/3680)   
20-May-2020 09:48:35 Receiving objects:  27% (994/3680)   
20-May-2020 09:48:35 Receiving objects:  28% (1031/3680)   
20-May-2020 09:48:35 Receiving objects:  29% (1068/3680)   
20-May-2020 09:48:35 Receiving objects:  30% (1104/3680)   
20-May-2020 09:48:35 Receiving objects:  31% (1141/3680)   
20-May-2020 09:48:35 Receiving objects:  32% (1178/3680)   
20-May-2020 09:48:35 Receiving objects:  33% (1215/3680)   
20-May-2020 09:48:35 Receiving objects:  34% (1252/3680)   
20-May-2020 09:48:35 Receiving objects:  35% (1288/3680)   
20-May-2020 09:48:35 Receiving objects:  36% (1325/3680)   
20-May-2020 09:48:35 Receiving objects:  37% (1362/3680)   
20-May-2020 09:48:35 Receiving objects:  38% (1399/3680)   
20-May-2020 09:48:35 Receiving objects:  39% (1436/3680)   
20-May-2020 09:48:35 Receiving objects:  40% (1472/3680)   
20-May-2020 09:48:35 Receiving objects:  41% (1509/3680)   
20-May-2020 09:48:35 Receiving objects:  42% (1546/3680)   
20-May-2020 09:48:35 Receiving objects:  43% (1583/3680)   
20-May-2020 09:48:35 Receiving objects:  44% (1620/3680)   
20-May-2020 09:48:35 Receiving objects:  45% (1656/3680)   
20-May-2020 09:48:35 Receiving objects:  46% (1693/3680)   
20-May-2020 09:48:35 Receiving objects:  47% (1730/3680)   
20-May-2020 09:48:35 Receiving objects:  48% (1767/3680)   
20-May-2020 09:48:35 Receiving objects:  49% (1804/3680)   
20-May-2020 09:48:35 Receiving objects:  50% (1840/3680)   
20-May-2020 09:48:35 Receiving objects:  51% (1877/3680)   
20-May-2020 09:48:35 Receiving objects:  52% (1914/3680)   
20-May-2020 09:48:35 Receiving objects:  53% (1951/3680)   
20-May-2020 09:48:35 Receiving objects:  54% (1988/3680)   
20-May-2020 09:48:35 Receiving objects:  55% (2024/3680)   
20-May-2020 09:48:35 Receiving objects:  56% (2061/3680)   
20-May-2020 09:48:35 Receiving objects:  57% (2098/3680)   
20-May-2020 09:48:35 Receiving objects:  58% (2135/3680)   
20-May-2020 09:48:35 Receiving objects:  59% (2172/3680)   
20-May-2020 09:48:35 Receiving objects:  60% (2208/3680)   
20-May-2020 09:48:35 Receiving objects:  61% (2245/3680)   
20-May-2020 09:48:35 Receiving objects:  62% (2282/3680)   
20-May-2020 09:48:35 Receiving objects:  63% (2319/3680)   
20-May-2020 09:48:35 Receiving objects:  64% (2356/3680)   
20-May-2020 09:48:35 Receiving objects:  65% (2392/3680)   
20-May-2020 09:48:35 Receiving objects:  66% (2429/3680)   
20-May-2020 09:48:35 Receiving objects:  67% (2466/3680)   
20-May-2020 09:48:35 Receiving objects:  68% (2503/3680)   
20-May-2020 09:48:35 Receiving objects:  69% (2540/3680)   
20-May-2020 09:48:35 Receiving objects:  70% (2576/3680)   
20-May-2020 09:48:35 Receiving objects:  71% (2613/3680)   
20-May-2020 09:48:35 Receiving objects:  72% (2650/3680)   
20-May-2020 09:48:35 Receiving objects:  73% (2687/3680)   
20-May-2020 09:48:35 Receiving objects:  74% (2724/3680)   
20-May-2020 09:48:35 Receiving objects:  75% (2760/3680)   
20-May-2020 09:48:35 Receiving objects:  76% (2797/3680)   
20-May-2020 09:48:35 Receiving objects:  77% (2834/3680)   
20-May-2020 09:48:35 Receiving objects:  78% (2871/3680)   
20-May-2020 09:48:35 Receiving objects:  79% (2908/3680)   
20-May-2020 09:48:35 Receiving objects:  80% (2944/3680)   
20-May-2020 09:48:35 Receiving objects:  81% (2981/3680)   
20-May-2020 09:48:35 Receiving objects:  82% (3018/3680)   
20-May-2020 09:48:35 Receiving objects:  83% (3055/3680)   
20-May-2020 09:48:35 Receiving objects:  84% (3092/3680)   
20-May-2020 09:48:35 Receiving objects:  85% (3128/3680)   
20-May-2020 09:48:35 Receiving objects:  86% (3165/3680)   
20-May-2020 09:48:35 Receiving objects:  87% (3202/3680)   
20-May-2020 09:48:35 Receiving objects:  88% (3239/3680)   
20-May-2020 09:48:35 Receiving objects:  89% (3276/3680)   
20-May-2020 09:48:35 Receiving objects:  90% (3312/3680)   
20-May-2020 09:48:35 Receiving objects:  91% (3349/3680)   
20-May-2020 09:48:35 Receiving objects:  92% (3386/3680)   
20-May-2020 09:48:35 Receiving objects:  93% (3423/3680)   
20-May-2020 09:48:35 Receiving objects:  94% (3460/3680)   
20-May-2020 09:48:35 Receiving objects:  95% (3496/3680)   
20-May-2020 09:48:35 remote: Total 3680 (delta 48), reused 77 (delta 17), pack-reused 3555       
20-May-2020 09:48:35 Receiving objects:  96% (3533/3680)   
20-May-2020 09:48:35 Receiving objects:  97% (3570/3680)   
20-May-2020 09:48:35 Receiving objects:  98% (3607/3680)   
20-May-2020 09:48:35 Receiving objects:  99% (3644/3680)   
20-May-2020 09:48:35 Receiving objects: 100% (3680/3680)   
20-May-2020 09:48:35 Receiving objects: 100% (3680/3680), 1.68 MiB | 4.19 MiB/s, done.
20-May-2020 09:48:35 Resolving deltas:   0% (0/1538)   
20-May-2020 09:48:35 Resolving deltas:   1% (17/1538)   
20-May-2020 09:48:35 Resolving deltas:   2% (40/1538)   
20-May-2020 09:48:35 Resolving deltas:   3% (51/1538)   
20-May-2020 09:48:35 Resolving deltas:   6% (107/1538)   
20-May-2020 09:48:35 Resolving deltas:   9% (151/1538)   
20-May-2020 09:48:35 Resolving deltas:  10% (156/1538)   
20-May-2020 09:48:35 Resolving deltas:  11% (175/1538)   
20-May-2020 09:48:35 Resolving deltas:  12% (191/1538)   
20-May-2020 09:48:35 Resolving deltas:  14% (226/1538)   
20-May-2020 09:48:35 Resolving deltas:  15% (240/1538)   
20-May-2020 09:48:35 Resolving deltas:  16% (255/1538)   
20-May-2020 09:48:35 Resolving deltas:  17% (273/1538)   
20-May-2020 09:48:35 Resolving deltas:  18% (282/1538)   
20-May-2020 09:48:35 Resolving deltas:  19% (304/1538)   
20-May-2020 09:48:35 Resolving deltas:  21% (330/1538)   
20-May-2020 09:48:35 Resolving deltas:  22% (352/1538)   
20-May-2020 09:48:35 Resolving deltas:  24% (373/1538)   
20-May-2020 09:48:35 Resolving deltas:  25% (387/1538)   
20-May-2020 09:48:35 Resolving deltas:  26% (401/1538)   
20-May-2020 09:48:35 Resolving deltas:  27% (419/1538)   
20-May-2020 09:48:35 Resolving deltas:  30% (464/1538)   
20-May-2020 09:48:35 Resolving deltas:  32% (499/1538)   
20-May-2020 09:48:35 Resolving deltas:  33% (520/1538)   
20-May-2020 09:48:35 Resolving deltas:  34% (527/1538)   
20-May-2020 09:48:35 Resolving deltas:  35% (549/1538)   
20-May-2020 09:48:35 Resolving deltas:  36% (562/1538)   
20-May-2020 09:48:35 Resolving deltas:  37% (571/1538)   
20-May-2020 09:48:35 Resolving deltas:  38% (591/1538)   
20-May-2020 09:48:35 Resolving deltas:  40% (630/1538)   
20-May-2020 09:48:35 Resolving deltas:  41% (632/1538)   
20-May-2020 09:48:35 Resolving deltas:  42% (646/1538)   
20-May-2020 09:48:35 Resolving deltas:  43% (667/1538)   
20-May-2020 09:48:35 Resolving deltas:  45% (693/1538)   
20-May-2020 09:48:35 Resolving deltas:  46% (716/1538)   
20-May-2020 09:48:35 Resolving deltas:  47% (734/1538)   
20-May-2020 09:48:35 Resolving deltas:  48% (740/1538)   
20-May-2020 09:48:35 Resolving deltas:  50% (770/1538)   
20-May-2020 09:48:35 Resolving deltas:  52% (800/1538)   
20-May-2020 09:48:35 Resolving deltas:  53% (820/1538)   
20-May-2020 09:48:35 Resolving deltas:  55% (856/1538)   
20-May-2020 09:48:35 Resolving deltas:  56% (873/1538)   
20-May-2020 09:48:35 Resolving deltas:  57% (891/1538)   
20-May-2020 09:48:35 Resolving deltas:  58% (899/1538)   
20-May-2020 09:48:35 Resolving deltas:  59% (909/1538)   
20-May-2020 09:48:35 Resolving deltas:  60% (927/1538)   
20-May-2020 09:48:35 Resolving deltas:  61% (943/1538)   
20-May-2020 09:48:35 Resolving deltas:  62% (954/1538)   
20-May-2020 09:48:35 Resolving deltas:  63% (969/1538)   
20-May-2020 09:48:35 Resolving deltas:  64% (993/1538)   
20-May-2020 09:48:35 Resolving deltas:  65% (1000/1538)   
20-May-2020 09:48:35 Resolving deltas:  66% (1018/1538)   
20-May-2020 09:48:35 Resolving deltas:  68% (1046/1538)   
20-May-2020 09:48:35 Resolving deltas:  69% (1062/1538)   
20-May-2020 09:48:35 Resolving deltas:  70% (1078/1538)   
20-May-2020 09:48:35 Resolving deltas:  71% (1096/1538)   
20-May-2020 09:48:35 Resolving deltas:  72% (1109/1538)   
20-May-2020 09:48:35 Resolving deltas:  73% (1124/1538)   
20-May-2020 09:48:35 Resolving deltas:  74% (1144/1538)   
20-May-2020 09:48:35 Resolving deltas:  78% (1208/1538)   
20-May-2020 09:48:35 Resolving deltas:  79% (1216/1538)   
20-May-2020 09:48:35 Resolving deltas:  81% (1249/1538)   
20-May-2020 09:48:35 Resolving deltas:  83% (1284/1538)   
20-May-2020 09:48:35 Resolving deltas:  84% (1294/1538)   
20-May-2020 09:48:35 Resolving deltas:  85% (1314/1538)   
20-May-2020 09:48:35 Resolving deltas:  86% (1326/1538)   
20-May-2020 09:48:35 Resolving deltas:  87% (1339/1538)   
20-May-2020 09:48:35 Resolving deltas:  88% (1355/1538)   
20-May-2020 09:48:35 Resolving deltas:  89% (1369/1538)   
20-May-2020 09:48:35 Resolving deltas:  90% (1390/1538)   
20-May-2020 09:48:35 Resolving deltas:  91% (1401/1538)   
20-May-2020 09:48:35 Resolving deltas:  92% (1415/1538)   
20-May-2020 09:48:35 Resolving deltas:  93% (1436/1538)   
20-May-2020 09:48:35 Resolving deltas:  94% (1457/1538)   
20-May-2020 09:48:35 Resolving deltas:  95% (1471/1538)   
20-May-2020 09:48:35 Resolving deltas:  96% (1478/1538)   
20-May-2020 09:48:35 Resolving deltas:  97% (1494/1538)   
20-May-2020 09:48:35 Resolving deltas:  98% (1514/1538)   
20-May-2020 09:48:35 Resolving deltas:  99% (1524/1538)   
20-May-2020 09:48:35 Resolving deltas: 100% (1538/1538)   
20-May-2020 09:48:35 Resolving deltas: 100% (1538/1538), done.
20-May-2020 09:48:35 From https://github.com/reactor/reactor-kafka
20-May-2020 09:48:35 * [new branch]      master     -> master
20-May-2020 09:48:35 * [new tag]         v1.0.0.M1      -> v1.0.0.M1
20-May-2020 09:48:35 * [new tag]         v1.0.0.M2      -> v1.0.0.M2
20-May-2020 09:48:35 * [new tag]         v1.0.0.M3      -> v1.0.0.M3
20-May-2020 09:48:35 * [new tag]         v1.0.0.M4      -> v1.0.0.M4
20-May-2020 09:48:35 * [new tag]         v1.0.0.RC1     -> v1.0.0.RC1
20-May-2020 09:48:35 * [new tag]         v1.0.0.RELEASE -> v1.0.0.RELEASE
20-May-2020 09:48:35 * [new tag]         v1.0.1.RELEASE -> v1.0.1.RELEASE
20-May-2020 09:48:35 * [new tag]         v1.1.0.RELEASE -> v1.1.0.RELEASE
20-May-2020 09:48:35 * [new tag]         v1.1.1.RELEASE -> v1.1.1.RELEASE
20-May-2020 09:48:35 * [new tag]         v1.2.1.RELEASE -> v1.2.1.RELEASE
20-May-2020 09:48:35 * [new tag]         v1.2.2.RELEASE -> v1.2.2.RELEASE
20-May-2020 09:48:35 Checking out revision 2cc44ba376fe1bf056fd68bd0c0580d86b9e0a1d.
20-May-2020 09:48:35 /usr/bin/git show-ref master
20-May-2020 09:48:35 /usr/bin/git checkout -f master
20-May-2020 09:48:35 Already on 'master'
20-May-2020 09:48:35 /usr/bin/git remote set-url origin file://nothing
20-May-2020 09:48:35 Updated source code to revision: 2cc44ba376fe1bf056fd68bd0c0580d86b9e0a1d
20-May-2020 09:48:35 Finished task 'Checkout' with result: Success
20-May-2020 09:48:35 Running pre-build action: Artifactory Release Staging
20-May-2020 09:48:35 Running pre-build action: VCS Version Collector
20-May-2020 09:48:35 Starting task 'Build Test Assemble' of type 'org.jfrog.bamboo.bamboo-artifactory-plugin:artifactoryGradleTask'
20-May-2020 09:48:35 Bamboo Artifactory Plugin version: 3.0.1
20-May-2020 09:48:35
Beginning to execute external process for build 'Project Reactor - Reactor Kafka - Kafka #869 (REACTOR-RKAFKA-AERON-869)'
... running command line:
./gradlew --stacktrace clean test assemble -DbuildInfoConfig.propertiesFile=/tmp/buildinfo2867048793822939031properties artifactoryPublish -Dartifactory.resolve.password=******** -Dartifactory.publish.password=********
... in: /opt/bamboo-home/xml-data/build-dir/REACTOR-RKAFKA-AERON
... using extra environment variables:
bamboo_planRepository_1_branch=master
bamboo_********_username_password=********
bamboo_signing_store_password=********
bamboo_capability_system_builder_ant_Ant_1_9=/opt/ant-1.9
bamboo_capability_system_builder_ant_Ant_1_8=/opt/ant-1.8
bamboo_planRepository_1_branchDisplayName=master
bamboo_artifactory_override_resolve_repo=libs-milestone
bamboo_capability_system_builder_node_Node_js_10_16=/opt/node-10.16/bin/node
bamboo_repository_revision_number=2cc44ba376fe1bf056fd68bd0c0580d86b9e0a1d
bamboo_repository_288522458_git_repositoryUrl=https://github.com/reactor/reactor-kafka.git
WRAPPER_BITS=32
bamboo_buildKey=REACTOR-RKAFKA-AERON
bamboo_ge_cache_username=ci
bamboo_bintray_password=********
bamboo_gradle_enterprise_cache_user=ci
bamboo_sonar_token_password=********
PWD=/opt/bamboo-home/bin
bamboo_shortJobName=Kafka
bamboo_artifactory_override_resolver_password=********
bamboo_sonatype_token=RSJChaox
bamboo_capability_system_builder_gradle___gradlew=./gradlew
bamboo_buildResultsUrl=https://build.spring.io/browse/REACTOR-RKAFKA-AERON-869
bamboo_capability_system_builder_mvn3_Maven_3_3=/opt/maven-3.3
bamboo_capability_system_builder_mvn3_Maven_3_2=/opt/maven-3.2
bamboo_capability_system_builder_mvn3_Maven_3_1=/opt/maven-3.1
bamboo_planRepository_repositoryUrl=https://github.com/reactor/reactor-kafka.git
bamboo_capability_system_builder_mvn3_Maven_3_6=/opt/maven-3.6
bamboo_agentId=286195714
bamboo_capability_system_builder_mvn3_Maven_3_5=/opt/maven-3.5
bamboo_capability_system_builder_mvn3_Maven_3_0=/opt/maven-3.0
bamboo_planRepository_revision=2cc44ba376fe1bf056fd68bd0c0580d86b9e0a1d
bamboo_planRepository_previousRevision=d0994d6d6ba86de837a35ac50f4e52382a4eacc2
bamboo_capability_remote_build=true
bamboo_repository_branch_name=master
bamboo_sonatype_token_password=********
bamboo_sonatype_user=springsource
SHLVL=1
bamboo_gradle_enterprise_cache_password=********
bamboo_org_jfrog_bamboo_buildInfo_serverUrl=https://repo.spring.io
bamboo_scdf_acceptance_tests_password=********
bamboo_APPLE_AC_PASSWORD=********
WRAPPER_OS=linux
JAVA_HOME=/opt/jdk-8/
TERM=linux
XDG_SESSION_ID=c1
bamboo_gradle_enterprise_secret_access_key=********
bamboo_planRepository_branch=master
bamboo_org_jfrog_bamboo_release_activated=false
bamboo_capability_system_jdk_JDK_15=/opt/jdk-15
bamboo_capability_system_jdk_JDK_13=/opt/jdk-13
bamboo_capability_system_jdk_JDK_14=/opt/jdk-14
bamboo_planRepository_1_type=gitv2
bamboo_planRepository_branchName=master
bamboo_capability_system_jdk_JDK_12=/opt/jdk-12
WRAPPER_FILE_SEPARATOR=/
_=/opt/bamboo-home/bin/bamboo-agent.sh
bamboo_capability_system_builder_gradlew_gradlew=./
bamboo_capability_system_builder_ant_Ant_1_10=/opt/ant-1.10
bamboo_repository_288522458_revision_number=2cc44ba376fe1bf056fd68bd0c0580d86b9e0a1d
WRAPPER_PATH_SEPARATOR=:
bamboo_sonar_password=********
bamboo_hg_cache_directory=/opt/bamboo-home/xml-data/build-dir/_hg-repositories-cache
bamboo_planRepository_1_username=spring-buildmaster
bamboo_planRepository_type=gitv2
bamboo_git_cache_directory=/opt/bamboo-home/xml-data/build-dir/_git-repositories-cache
bamboo_artifactory_username=buildmaster
bamboo_tmp_directory=/opt/bamboo-home/temp
bamboo_planKey=REACTOR-RKAFKA
bamboo_planRepository_username=spring-buildmaster
bamboo_JDK8_HOME=/opt/jdk-8
bamboo_repository_288522458_git_branch=master
bamboo_planRepository_1_branchName=master
bamboo_sonar_version=6.7.7
bamboo_sonar_jdbc_password=********
bamboo_bintray_api_key_password=********
XDG_DATA_DIRS=/usr/local/share:/usr/share:/var/lib/snapd/desktop
bamboo_capability_system_jdk_JDK_1_11=/opt/jdk-11
bamboo_resultsUrl=https://build.spring.io/browse/REACTOR-RKAFKA-AERON-869
bamboo_APPLE_AC_USERNAME_PASSWORD=********
bamboo_capability_system_jdk_JDK_1_10=/opt/jdk-10
bamboo_build_working_directory=/opt/bamboo-home/xml-data/build-dir/REACTOR-RKAFKA-AERON
bamboo_planRepository_1_name=reactor-kafka
bamboo_capability_system_os=ubuntu1804
bamboo_nexusPush_stagingProfile=buildmaster
bamboo_shortPlanName=Reactor Kafka
MAIL=/var/mail/bamboo
bamboo_planRepository_name=reactor-kafka
LOGNAME=bamboo
bamboo_buildNumber=869
bamboo_repository_288522458_name=reactor-kafka
SHELL=/bin/bash
bamboo_planName=Project Reactor - Reactor Kafka
bamboo_JDK7_HOME=/opt/jdk-7
bamboo_shortPlanKey=RKAFKA
OLDPWD=/opt/users/bamboo
bamboo_shortJobKey=AERON
bamboo_artifactory_password=********
bamboo_buildTimeStamp=2020-05-20T09:48:33.460Z
bamboo_repository_previous_revision_number=d0994d6d6ba86de837a35ac50f4e52382a4eacc2
bamboo_sonar_username=buildmaster
bamboo_********_password=********
bamboo_repository_git_branch=master
bamboo_buildResultKey=REACTOR-RKAFKA-AERON-869
bamboo_nexusPush_close=true
bamboo_artifactory_override_resolver_username=buildmaster
bamboo_buildPlanName=Project Reactor - Reactor Kafka - Kafka
bamboo_planRepository_1_revision=2cc44ba376fe1bf056fd68bd0c0580d86b9e0a1d
bamboo_repository_name=reactor-kafka
bamboo_signing_key_password=********
bamboo_capability_system_builder_groovy_Groovy_2_5=/opt/groovy-2.5
LANG=en_US.UTF-8
bamboo_buildFailed=false
bamboo_capability_system_docker_executable=/usr/bin/docker
DISPLAY=localhost:1.0
bamboo_capability_system_jdk_OpenJDK_7=/opt/jdk-7
bamboo_capability_system_builder_groovy_Groovy_2_4=/opt/groovy-2.4
bamboo_artifactory_override_deployer_username=buildmaster
bamboo_artifactory_password_mask_b=********
bamboo_capability_system_builder_command_Bash=/bin/bash
bamboo_artifactory_password_mask_a=********
bamboo_agentWorkingDirectory=/opt/bamboo-home/xml-data/build-dir
bamboo_capability_system_git_executable=/usr/bin/git
bamboo_repository_git_username=spring-buildmaster
bamboo_planRepository_1_previousRevision=d0994d6d6ba86de837a35ac50f4e52382a4eacc2
bamboo_repository_288522458_previous_revision_number=d0994d6d6ba86de837a35ac50f4e52382a4eacc2
bamboo_capability_os_family=unix
bamboo_planRepository_branchDisplayName=master
bamboo_capability_system_builder_maven_Artifactory_Maven_3_6=/opt/maven-3.6
bamboo_capability_system_builder_maven_Artifactory_Maven_3_5=/opt/maven-3.5
GIT_SSL_NO_VERIFY=true
bamboo_capability_system_builder_maven_Artifactory_Maven_3_3=/opt/maven-3.3
bamboo_capability_system_builder_maven_Artifactory_Maven_3_2=/opt/maven-3.2
bamboo_repository_288522458_branch_name=master
bamboo_s3_properties=/home/bamboo/tools/s3.properties
bamboo_capability_system_builder_maven_Artifactory_Maven_3_1=/opt/maven-3.1
bamboo_artifactory_override_deploy_repo=libs-snapshot-local
bamboo_capability_system_builder_maven_Artifactory_Maven_3_0=/opt/maven-3.0
bamboo_plan_storageTag=REACTOR-RKAFKA
bamboo_bintray_username_password=********
USER=bamboo
bamboo_repository_git_repositoryUrl=https://github.com/reactor/reactor-kafka.git
bamboo_repository_288522458_git_username=spring-buildmaster
bamboo_working_directory=/opt/bamboo-home/xml-data/build-dir/REACTOR-RKAFKA-AERON
bamboo_org_jfrog_bamboo_buildInfo_activated=true
bamboo_planRepository_1_repositoryUrl=https://github.com/reactor/reactor-kafka.git
bamboo_capability_system_jdk_JDK_1_8=/opt/jdk-8
bamboo_artifactory_override_deployer_password=********
bamboo_capability_system_jdk_JDK_1_9=/opt/jdk-9
WRAPPER_ARCH=x86
bamboo_capability_system_jdk_JDK_1_6=/opt/jdk-6
bamboo_sonatype_password=********
bamboo_capability_system_jdk_JDK_1_7=/opt/jdk-7
bamboo_sonar_ip=10.194.6.9
XDG_RUNTIME_DIR=/run/user/1002
HOME=/home/bamboo
bamboo_ge_cache_password=********
PATH=/bin:/home/bamboo/bin:/usr/local/sbin:/usr/local/bin:/usr/sbin:/usr/bin:/sbin:/bin:/usr/games:/usr/local/games:/snap/bin:/home/bamboo/bin:/usr/local/bin:/bin:/home/bamboo/bin:/usr/local/sbin:/usr/local/bin:/usr/sbin:/usr/bin:/sbin:/bin:/usr/games:/usr/local/games:/snap/bin:/home/bamboo/bin:/usr/local/bin
20-May-2020 09:48:36 Starting a Gradle Daemon (subsequent builds will be faster)
20-May-2020 09:48:41 > Task :clean UP-TO-DATE
20-May-2020 09:48:41 > Task :reactor-kafka-samples:clean UP-TO-DATE
20-May-2020 09:48:41 > Task :reactor-kafka-tools:clean UP-TO-DATE
20-May-2020 09:48:44 /opt/users/bamboo/.gradle/caches/modules-2/files-2.1/io.projectreactor/reactor-core/3.4.0-SNAPSHOT/fa2ed6df0a1e35e28eb2bf4725dff452fc298051/reactor-core-3.4.0-SNAPSHOT.jar(reactor/util/annotation/Nullable.class): warning: Cannot find annotation method 'when()' in type 'Nonnull': class file for javax.annotation.Nonnull not found
20-May-2020 09:48:44 warning: unknown enum constant When.MAYBE
20-May-2020 09:48:44   reason: class file for javax.annotation.meta.When not found
20-May-2020 09:48:44
20-May-2020 09:48:44 > Task :compileJava
20-May-2020 09:48:44 /opt/bamboo-home/xml-data/build-dir/REACTOR-RKAFKA-AERON/src/main/java/reactor/kafka/sender/SenderOptions.java:27: warning: [deprecation] MutableSenderOptions in reactor.kafka.sender has been deprecated
20-May-2020 09:48:44         return new MutableSenderOptions<>();
20-May-2020 09:48:44                    ^
20-May-2020 09:48:44 /opt/bamboo-home/xml-data/build-dir/REACTOR-RKAFKA-AERON/src/main/java/reactor/kafka/sender/SenderOptions.java:37: warning: [deprecation] MutableSenderOptions in reactor.kafka.sender has been deprecated
20-May-2020 09:48:44         return new MutableSenderOptions<>(configProperties);
20-May-2020 09:48:44                    ^
20-May-2020 09:48:44 /opt/bamboo-home/xml-data/build-dir/REACTOR-RKAFKA-AERON/src/main/java/reactor/kafka/sender/SenderOptions.java:47: warning: [deprecation] MutableSenderOptions in reactor.kafka.sender has been deprecated
20-May-2020 09:48:44         return new MutableSenderOptions<>(configProperties);
20-May-2020 09:48:44                    ^
20-May-2020 09:48:44 /opt/bamboo-home/xml-data/build-dir/REACTOR-RKAFKA-AERON/src/main/java/reactor/kafka/sender/internals/DefaultKafkaSender.java:87: warning: [deprecation] toImmutable() in SenderOptions has been deprecated
20-May-2020 09:48:44         this.senderOptions = options.toImmutable()
20-May-2020 09:48:44                                     ^
20-May-2020 09:48:44   where K,V are type-variables:
20-May-2020 09:48:44     K extends Object declared in interface SenderOptions
20-May-2020 09:48:44     V extends Object declared in interface SenderOptions
20-May-2020 09:48:44 /opt/bamboo-home/xml-data/build-dir/REACTOR-RKAFKA-AERON/src/main/java/reactor/kafka/receiver/ReceiverOptions.java:31: warning: [deprecation] MutableReceiverOptions in reactor.kafka.receiver has been deprecated
20-May-2020 09:48:44         return new MutableReceiverOptions<>();
20-May-2020 09:48:44                    ^
20-May-2020 09:48:44 /opt/bamboo-home/xml-data/build-dir/REACTOR-RKAFKA-AERON/src/main/java/reactor/kafka/receiver/ReceiverOptions.java:40: warning: [deprecation] MutableReceiverOptions in reactor.kafka.receiver has been deprecated
20-May-2020 09:48:44         return new MutableReceiverOptions<>(configProperties);
20-May-2020 09:48:44                    ^
20-May-2020 09:48:44 /opt/bamboo-home/xml-data/build-dir/REACTOR-RKAFKA-AERON/src/main/java/reactor/kafka/receiver/ReceiverOptions.java:49: warning: [deprecation] MutableReceiverOptions in reactor.kafka.receiver has been deprecated
20-May-2020 09:48:44         return new MutableReceiverOptions<>(configProperties);
20-May-2020 09:48:44                    ^
20-May-2020 09:48:44 /opt/bamboo-home/xml-data/build-dir/REACTOR-RKAFKA-AERON/src/main/java/reactor/kafka/receiver/internals/DefaultKafkaReceiver.java:47: warning: [deprecation] toImmutable() in ReceiverOptions has been deprecated
20-May-2020 09:48:44         this.receiverOptions = receiverOptions.toImmutable();
20-May-2020 09:48:44                                               ^
20-May-2020 09:48:44   where K,V are type-variables:
20-May-2020 09:48:44     K extends Object declared in interface ReceiverOptions
20-May-2020 09:48:44     V extends Object declared in interface ReceiverOptions
20-May-2020 09:48:44 /opt/bamboo-home/xml-data/build-dir/REACTOR-RKAFKA-AERON/src/main/java/reactor/kafka/receiver/internals/ConsumerEventLoop.java:376: warning: [deprecation] close(long,TimeUnit) in Consumer has been deprecated
20-May-2020 09:48:44                             consumer.close(timeoutNanos, TimeUnit.NANOSECONDS);
20-May-2020 09:48:44                                     ^
20-May-2020 09:48:44 11 warnings
20-May-2020 09:48:44
20-May-2020 09:48:44 > Task :processResources NO-SOURCE
20-May-2020 09:48:44 > Task :classes
20-May-2020 09:48:46 > Task :checkstyleMain
20-May-2020 09:48:48 /opt/users/bamboo/.gradle/caches/modules-2/files-2.1/io.projectreactor/reactor-core/3.4.0-SNAPSHOT/fa2ed6df0a1e35e28eb2bf4725dff452fc298051/reactor-core-3.4.0-SNAPSHOT.jar(reactor/util/annotation/Nullable.class): warning: Cannot find annotation method 'when()' in type 'Nonnull': class file for javax.annotation.Nonnull not found
20-May-2020 09:48:48 warning: unknown enum constant When.MAYBE
20-May-2020 09:48:48   reason: class file for javax.annotation.meta.When not found
20-May-2020 09:48:48 /opt/bamboo-home/xml-data/build-dir/REACTOR-RKAFKA-AERON/src/test/java/reactor/kafka/sender/KafkaSenderTest.java:556: warning: [deprecation] poll(long) in Consumer has been deprecated
20-May-2020 09:48:48         consumer.poll(requestTimeoutMillis);
20-May-2020 09:48:48                 ^
20-May-2020 09:48:48   where K,V are type-variables:
20-May-2020 09:48:48     K extends Object declared in interface Consumer
20-May-2020 09:48:48     V extends Object declared in interface Consumer
20-May-2020 09:48:48 /opt/bamboo-home/xml-data/build-dir/REACTOR-RKAFKA-AERON/src/test/java/reactor/kafka/sender/KafkaSenderTest.java:564: warning: [deprecation] poll(long) in Consumer has been deprecated
20-May-2020 09:48:48             ConsumerRecords<Integer, String> records = consumer.poll(1000);
20-May-2020 09:48:48                                                                ^
20-May-2020 09:48:48   where K,V are type-variables:
20-May-2020 09:48:48     K extends Object declared in interface Consumer
20-May-2020 09:48:48     V extends Object declared in interface Consumer
20-May-2020 09:48:48 /opt/bamboo-home/xml-data/build-dir/REACTOR-RKAFKA-AERON/src/test/java/reactor/kafka/sender/KafkaSenderTest.java:571: warning: [deprecation] poll(long) in Consumer has been deprecated
20-May-2020 09:48:48         ConsumerRecords<Integer, String> records = consumer.poll(500);
20-May-2020 09:48:48                                                            ^
20-May-2020 09:48:48   where K,V are type-variables:
20-May-2020 09:48:48     K extends Object declared in interface Consumer
20-May-2020 09:48:48     V extends Object declared in interface Consumer
20-May-2020 09:48:48 /opt/bamboo-home/xml-data/build-dir/REACTOR-RKAFKA-AERON/src/test/java/reactor/kafka/receiver/ReceiverOptionsTest.java:46: warning: [deprecation] toImmutable() in ReceiverOptions has been deprecated
20-May-2020 09:48:48         ReceiverOptions<String, String> immutableOptions = receiverOptions.toImmutable();
20-May-2020 09:48:48                                                                           ^
20-May-2020 09:48:48   where K,V are type-variables:
20-May-2020 09:48:48     K extends Object declared in interface ReceiverOptions
20-May-2020 09:48:48     V extends Object declared in interface ReceiverOptions
20-May-2020 09:48:48 /opt/bamboo-home/xml-data/build-dir/REACTOR-RKAFKA-AERON/src/test/java/reactor/kafka/receiver/KafkaReceiverTest.java:609: warning: [deprecation] retry(Predicate<? super Throwable>) in Mono has been deprecated
20-May-2020 09:48:48                         .retry(retryPredicate)
20-May-2020 09:48:48                         ^
20-May-2020 09:48:48   where T is a type-variable:
20-May-2020 09:48:48     T extends Object declared in class Mono
20-May-2020 09:48:48 /opt/bamboo-home/xml-data/build-dir/REACTOR-RKAFKA-AERON/src/test/java/reactor/kafka/receiver/KafkaReceiverTest.java:851: warning: [deprecation] close(long,TimeUnit) in ConsumerDelegate has been deprecated
20-May-2020 09:48:48                             public void close(long timeout, TimeUnit unit) {
20-May-2020 09:48:48                                         ^
20-May-2020 09:48:48 /opt/bamboo-home/xml-data/build-dir/REACTOR-RKAFKA-AERON/src/test/java/reactor/kafka/receiver/KafkaReceiverTest.java:853: warning: [deprecation] close(long,TimeUnit) in ConsumerDelegate has been deprecated
20-May-2020 09:48:48                                 super.close(timeout, unit);
20-May-2020 09:48:48                                      ^
20-May-2020 09:48:48 /opt/bamboo-home/xml-data/build-dir/REACTOR-RKAFKA-AERON/src/test/java/reactor/kafka/receiver/KafkaReceiverTest.java:1321: warning: [deprecation] retryBackoff(long,Duration) in Mono has been deprecated
20-May-2020 09:48:48                                             .retryBackoff(100, Duration.ofMillis(100)))
20-May-2020 09:48:48                                             ^
20-May-2020 09:48:48   where T is a type-variable:
20-May-2020 09:48:48     T extends Object declared in class Mono
20-May-2020 09:48:48 /opt/bamboo-home/xml-data/build-dir/REACTOR-RKAFKA-AERON/src/test/java/reactor/kafka/receiver/internals/MockReceiverTest.java:1230: warning: [deprecation] poll(long) in Consumer has been deprecated
20-May-2020 09:48:48         testDisallowedConsumerMethod(c -> c.poll(0));
20-May-2020 09:48:48                                            ^
20-May-2020 09:48:48   where K,V are type-variables:
20-May-2020 09:48:48     K extends Object declared in interface Consumer
20-May-2020 09:48:48     V extends Object declared in interface Consumer
20-May-2020 09:48:48 /opt/bamboo-home/xml-data/build-dir/REACTOR-RKAFKA-AERON/src/test/java/reactor/kafka/receiver/internals/ChaosConsumerFactory.java:32: warning: [rawtypes] found raw type: Class
20-May-2020 09:48:48             new Class[]{org.apache.kafka.clients.consumer.Consumer.class},
20-May-2020 09:48:48                 ^
20-May-2020 09:48:48   missing type arguments for generic class Class<T>
20-May-2020 09:48:48   where T is a type-variable:
20-May-2020 09:48:48     T extends Object declared in class Class
20-May-2020 09:48:48 /opt/bamboo-home/xml-data/build-dir/REACTOR-RKAFKA-AERON/src/test/java/reactor/kafka/receiver/internals/ChaosConsumerFactory.java:42: warning: [unchecked] unchecked method invocation: constructor <init> in class HashMap is applied to given types
20-May-2020 09:48:48                                 Map<TopicPartition, OffsetAndMetadata> offsets = new HashMap<>((Map) args[0]);
20-May-2020 09:48:48                                                                                  ^
20-May-2020 09:48:48   required: Map<? extends K,? extends V>
20-May-2020 09:48:48   found: Map
20-May-2020 09:48:48   where K,V are type-variables:
20-May-2020 09:48:48     K extends Object declared in class HashMap
20-May-2020 09:48:48     V extends Object declared in class HashMap
20-May-2020 09:48:48 /opt/bamboo-home/xml-data/build-dir/REACTOR-RKAFKA-AERON/src/test/java/reactor/kafka/receiver/internals/ChaosConsumerFactory.java:42: warning: [unchecked] unchecked conversion
20-May-2020 09:48:48                                 Map<TopicPartition, OffsetAndMetadata> offsets = new HashMap<>((Map) args[0]);
20-May-2020 09:48:48                                                                                                ^
20-May-2020 09:48:48   required: Map<? extends K,? extends V>
20-May-2020 09:48:48   found:    Map
20-May-2020 09:48:48   where K,V are type-variables:
20-May-2020 09:48:48     K extends Object declared in class HashMap
20-May-2020 09:48:48     V extends Object declared in class HashMap
20-May-2020 09:48:48 /opt/bamboo-home/xml-data/build-dir/REACTOR-RKAFKA-AERON/src/test/java/reactor/kafka/receiver/internals/ChaosConsumerFactory.java:42: warning: [unchecked] unchecked conversion
20-May-2020 09:48:48                                 Map<TopicPartition, OffsetAndMetadata> offsets = new HashMap<>((Map) args[0]);
20-May-2020 09:48:48                                                                                  ^
20-May-2020 09:48:48   required: Map<TopicPartition,OffsetAndMetadata>
20-May-2020 09:48:48   found:    HashMap
20-May-2020 09:48:48 /opt/bamboo-home/xml-data/build-dir/REACTOR-RKAFKA-AERON/src/test/java/reactor/kafka/receiver/internals/ChaosConsumerFactory.java:30: warning: [unchecked] unchecked cast
20-May-2020 09:48:48         return (org.apache.kafka.clients.consumer.Consumer<K, V>) Proxy.newProxyInstance(
20-May-2020 09:48:48                                                                                         ^
20-May-2020 09:48:48   required: Consumer<K,V>
20-May-2020 09:48:48   found:    Object
20-May-2020 09:48:48   where K,V are type-variables:
20-May-2020 09:48:48     K extends Object declared in method <K,V>createConsumer(ReceiverOptions<K,V>)
20-May-2020 09:48:48     V extends Object declared in method <K,V>createConsumer(ReceiverOptions<K,V>)
20-May-2020 09:48:48 16 warnings
20-May-2020 09:48:48
20-May-2020 09:48:48 > Task :compileTestJava
20-May-2020 09:48:48
20-May-2020 09:48:48 > Task :processTestResources
20-May-2020 09:48:48 > Task :testClasses
20-May-2020 09:48:48 > Task :checkstyleTest
20-May-2020 09:49:18 > Task :test
20-May-2020 09:49:21
20-May-2020 09:49:21 reactor.kafka.sender.KafkaSenderTest > concurrentSends PASSED
20-May-2020 09:49:24
20-May-2020 09:49:24 reactor.kafka.sender.KafkaSenderTest > sendWithResponse PASSED
20-May-2020 09:49:27
20-May-2020 09:49:27 reactor.kafka.sender.KafkaSenderTest > idempotentSender SKIPPED
20-May-2020 09:50:32
20-May-2020 09:50:32 reactor.kafka.sender.KafkaSenderTest > transactionalSenderFencing PASSED
20-May-2020 09:50:36
20-May-2020 09:50:36 reactor.kafka.sender.KafkaSenderTest > sendDontStopOnSerializationError PASSED
20-May-2020 09:50:39
20-May-2020 09:50:39 reactor.kafka.sender.KafkaSenderTest > sendResponseBlock PASSED
20-May-2020 09:50:42
20-May-2020 09:50:42 reactor.kafka.sender.KafkaSenderTest > sendChainFailure SKIPPED
20-May-2020 09:50:46
20-May-2020 09:50:46 reactor.kafka.sender.KafkaSenderTest > sendNoResponse PASSED
20-May-2020 09:50:49
20-May-2020 09:50:49 reactor.kafka.sender.KafkaSenderTest > sendStopOnError SKIPPED
20-May-2020 09:50:53
20-May-2020 09:50:53 reactor.kafka.sender.KafkaSenderTest > sendChain PASSED
20-May-2020 09:50:56
20-May-2020 09:50:56 reactor.kafka.sender.KafkaSenderTest > sendResponseCorrelator PASSED
20-May-2020 09:51:00
20-May-2020 09:51:00 reactor.kafka.sender.KafkaSenderTest > sendResume SKIPPED
20-May-2020 09:51:03
20-May-2020 09:51:03 reactor.kafka.sender.KafkaSenderTest > sendNoResponseFailure SKIPPED
20-May-2020 09:51:06
20-May-2020 09:51:06 reactor.kafka.sender.KafkaSenderTest > sendResponseEmitter PASSED
20-May-2020 09:51:10
20-May-2020 09:51:10 reactor.kafka.sender.KafkaSenderTest > sendDontStopOnError SKIPPED
20-May-2020 09:51:23
20-May-2020 09:51:23 reactor.kafka.sender.KafkaSenderTest > maxInFlight PASSED
20-May-2020 09:51:27
20-May-2020 09:51:27 reactor.kafka.sender.KafkaSenderTest > fireAndForget PASSED
20-May-2020 09:51:31
20-May-2020 09:51:31 reactor.kafka.sender.KafkaSenderTest > transactionalSenderFencingMidTransaction PASSED
20-May-2020 09:51:35
20-May-2020 09:51:35 reactor.kafka.sender.KafkaSenderTest > transaction PASSED
20-May-2020 09:51:35
20-May-2020 09:51:35 reactor.kafka.sender.internals.MockSenderTest > producerCreate PASSED
20-May-2020 09:51:35
20-May-2020 09:51:35 reactor.kafka.sender.internals.MockSenderTest > sendWithResponse PASSED
20-May-2020 09:51:35
20-May-2020 09:51:35 reactor.kafka.sender.internals.MockSenderTest > partitionsFor PASSED
20-May-2020 09:51:35
20-May-2020 09:51:35 reactor.kafka.sender.internals.MockSenderTest > commitTransaction PASSED
20-May-2020 09:51:35
20-May-2020 09:51:35 reactor.kafka.sender.internals.MockSenderTest > sendConcurrentChains PASSED
20-May-2020 09:51:35
20-May-2020 09:51:35 reactor.kafka.sender.internals.MockSenderTest > sendChainFailure PASSED
20-May-2020 09:51:35
20-May-2020 09:51:35 reactor.kafka.sender.internals.MockSenderTest > sendWithResponseFailure PASSED
20-May-2020 09:51:35
20-May-2020 09:51:35 reactor.kafka.sender.internals.MockSenderTest > sendNoResponse PASSED
20-May-2020 09:51:35
20-May-2020 09:51:35 reactor.kafka.sender.internals.MockSenderTest > maxInFlightNoResponse PASSED
20-May-2020 09:51:35
20-May-2020 09:51:35 reactor.kafka.sender.internals.MockSenderTest > sendNoResponseDontStopOnError PASSED
20-May-2020 09:51:35
20-May-2020 09:51:35 reactor.kafka.sender.internals.MockSenderTest > sendNoResponseIgnoreError PASSED
20-May-2020 09:51:35
20-May-2020 09:51:35 reactor.kafka.sender.internals.MockSenderTest > partitionsForNonExistentTopic PASSED
20-May-2020 09:51:35
20-May-2020 09:51:35 reactor.kafka.sender.internals.MockSenderTest > sendChain PASSED
20-May-2020 09:51:35
20-May-2020 09:51:35 reactor.kafka.sender.internals.MockSenderTest > sendRetry PASSED
20-May-2020 09:51:35
20-May-2020 09:51:35 reactor.kafka.sender.internals.MockSenderTest > illegalTransactionState PASSED
20-May-2020 09:51:35
20-May-2020 09:51:35 reactor.kafka.sender.internals.MockSenderTest > outboundMonoScheduler PASSED
20-May-2020 09:51:35
20-May-2020 09:51:35 reactor.kafka.sender.internals.MockSenderTest > sendResume PASSED
20-May-2020 09:51:40
20-May-2020 09:51:40 reactor.kafka.sender.internals.MockSenderTest > sendWithResponseCallbackFailure PASSED
20-May-2020 09:51:40
20-May-2020 09:51:40 reactor.kafka.sender.internals.MockSenderTest > sendConcurrent PASSED
20-May-2020 09:51:40
20-May-2020 09:51:40 reactor.kafka.sender.internals.MockSenderTest > sendRetryFailure PASSED
20-May-2020 09:51:40
20-May-2020 09:51:40 reactor.kafka.sender.internals.MockSenderTest > producerMethods PASSED
20-May-2020 09:51:40
20-May-2020 09:51:40 reactor.kafka.sender.internals.MockSenderTest > responseFluxScheduler PASSED
20-May-2020 09:51:40
20-May-2020 09:51:40 reactor.kafka.sender.internals.MockSenderTest > sendWithResponseStopOnError PASSED
20-May-2020 09:51:40
20-May-2020 09:51:40 reactor.kafka.sender.internals.MockSenderTest > sendNoResponseFailure PASSED
20-May-2020 09:51:40
20-May-2020 09:51:40 reactor.kafka.sender.internals.MockSenderTest > sendDontStopOnError PASSED
20-May-2020 09:51:40
20-May-2020 09:51:40 reactor.kafka.sender.internals.MockSenderTest > maxInFlight PASSED
20-May-2020 09:51:40
20-May-2020 09:51:40 reactor.kafka.sender.internals.MockSenderTest > producerClose PASSED
20-May-2020 09:51:40
20-May-2020 09:51:40 reactor.kafka.sender.internals.MockSenderTest > producerDisallowedMethods PASSED
20-May-2020 09:51:40
20-May-2020 09:51:40 reactor.kafka.sender.internals.MockSenderTest > sendChainThen PASSED
20-May-2020 09:51:40
20-May-2020 09:51:40 reactor.kafka.sender.internals.MockSenderTest > abortTransaction PASSED
20-May-2020 09:51:40
20-May-2020 09:51:40 reactor.kafka.sender.internals.MockTransactionTest > transactionFailure PASSED
20-May-2020 09:51:41
20-May-2020 09:51:41 reactor.kafka.sender.internals.MockTransactionTest > transactionalReceiveAndSend PASSED
20-May-2020 09:51:41
20-May-2020 09:51:41 reactor.kafka.sender.internals.MockTransactionTest > transactionBeginAbort PASSED
20-May-2020 09:51:41
20-May-2020 09:51:41 reactor.kafka.sender.internals.MockTransactionTest > transactionBeginCommit PASSED
20-May-2020 09:51:41
20-May-2020 09:51:41 reactor.kafka.sender.internals.MockTransactionTest > transactionAbort PASSED
20-May-2020 09:51:42
20-May-2020 09:51:42 reactor.kafka.receiver.KafkaReceiverTest > sendTransactionalReadCommitted PASSED
20-May-2020 09:51:42
20-May-2020 09:51:42 reactor.kafka.receiver.KafkaReceiverTest > manualAssignmentListeners PASSED
20-May-2020 09:51:43
20-May-2020 09:51:43 reactor.kafka.receiver.KafkaReceiverTest > manualCommitSync PASSED
20-May-2020 09:51:44
20-May-2020 09:51:44 reactor.kafka.receiver.KafkaReceiverTest > manualAssignment PASSED
20-May-2020 09:51:45
20-May-2020 09:51:45 reactor.kafka.receiver.KafkaReceiverTest > atleastOnceClose PASSED
20-May-2020 09:51:45
20-May-2020 09:51:45 reactor.kafka.receiver.KafkaReceiverTest > manualCommitAsyncNoPoll PASSED
20-May-2020 09:51:45
20-May-2020 09:51:45 reactor.kafka.receiver.KafkaReceiverTest > wildcardSubscribe PASSED
20-May-2020 09:51:45
20-May-2020 09:51:45 reactor.kafka.receiver.KafkaReceiverTest > publishFromEventScheduler PASSED
20-May-2020 09:51:46
20-May-2020 09:51:46 reactor.kafka.receiver.KafkaReceiverTest > sendTransactionalReadUncommitted PASSED
20-May-2020 09:51:48
20-May-2020 09:51:48 reactor.kafka.receiver.KafkaReceiverTest > atmostOnce PASSED
20-May-2020 09:51:51
20-May-2020 09:51:51 reactor.kafka.receiver.KafkaReceiverTest > autoCommitFailurePropagationAfterRetries PASSED
20-May-2020 09:51:55
20-May-2020 09:51:55 reactor.kafka.receiver.KafkaReceiverTest > autoCommitNonRetriableException PASSED
20-May-2020 09:51:55
20-May-2020 09:51:55 reactor.kafka.receiver.KafkaReceiverTest > seekToBeginning PASSED
20-May-2020 09:51:55
20-May-2020 09:51:55 reactor.kafka.receiver.KafkaReceiverTest > brokerRestart SKIPPED
20-May-2020 09:52:08
20-May-2020 09:52:08 reactor.kafka.receiver.KafkaReceiverTest > messageProcessingDelay PASSED
20-May-2020 09:52:10
20-May-2020 09:52:10 reactor.kafka.receiver.KafkaReceiverTest > transactionalOffsetCommit PASSED
20-May-2020 09:52:10
20-May-2020 09:52:10 reactor.kafka.receiver.KafkaReceiverTest > autoAckPollWithIntervalWillNotFailOnOverflow SKIPPED
20-May-2020 09:52:11
20-May-2020 09:52:11 reactor.kafka.receiver.KafkaReceiverTest > autoAck PASSED
20-May-2020 09:52:12
20-May-2020 09:52:12 reactor.kafka.receiver.KafkaReceiverTest > offsetResetLatest PASSED
20-May-2020 09:52:12
20-May-2020 09:52:12 reactor.kafka.receiver.KafkaReceiverTest > resumeAfterFailure PASSED
20-May-2020 09:52:13
20-May-2020 09:52:13 reactor.kafka.receiver.KafkaReceiverTest > consumerClose PASSED
20-May-2020 09:52:26
20-May-2020 09:52:26 reactor.kafka.receiver.KafkaReceiverTest > groupByPartition PASSED
20-May-2020 09:52:26
20-May-2020 09:52:26 reactor.kafka.receiver.KafkaReceiverTest > manualCommitBatch PASSED
20-May-2020 09:52:27
20-May-2020 09:52:27 reactor.kafka.receiver.KafkaReceiverTest > manualCommitRetry PASSED
20-May-2020 09:52:27
20-May-2020 09:52:27 reactor.kafka.receiver.KafkaReceiverTest > manualCommitRecordAsync PASSED
20-May-2020 09:52:37
20-May-2020 09:52:37 reactor.kafka.receiver.KafkaReceiverTest > atleastOnceCommitRecord PASSED
20-May-2020 09:52:37
20-May-2020 09:52:37 reactor.kafka.receiver.KafkaReceiverTest > publishFromCustomScheduler PASSED
20-May-2020 09:52:38
20-May-2020 09:52:38 reactor.kafka.receiver.KafkaReceiverTest > sendReceiveWithHeaders PASSED
20-May-2020 09:52:38
20-May-2020 09:52:38 reactor.kafka.receiver.KafkaReceiverTest > manualCommitNonRetriableException PASSED
20-May-2020 09:52:38
20-May-2020 09:52:38 reactor.kafka.receiver.KafkaReceiverTest > seekToOffset PASSED
20-May-2020 09:52:45
20-May-2020 09:52:45 reactor.kafka.receiver.KafkaReceiverTest > atleastOnceCommitBatchSize PASSED
20-May-2020 09:52:45
20-May-2020 09:52:45 reactor.kafka.receiver.KafkaReceiverTest > sendReceive PASSED
20-May-2020 09:52:45
20-May-2020 09:52:45 reactor.kafka.receiver.KafkaReceiverTest > seekToEnd PASSED
20-May-2020 09:52:55
20-May-2020 09:52:55 reactor.kafka.receiver.KafkaReceiverTest > multiConsumerGroup PASSED
20-May-2020 09:52:56
20-May-2020 09:52:56 reactor.kafka.receiver.KafkaReceiverTest > sendNonTransactionalReadCommitted PASSED
20-May-2020 09:52:58
20-May-2020 09:52:58 reactor.kafka.receiver.KafkaReceiverTest > manualAssignmentWithCommit PASSED
20-May-2020 09:52:58
20-May-2020 09:52:58 reactor.kafka.receiver.KafkaReceiverTest > messageProcessorFailure PASSED
20-May-2020 09:52:58
20-May-2020 09:52:58 reactor.kafka.receiver.KafkaReceiverTest > manualCommitFailure PASSED
20-May-2020 09:52:58
20-May-2020 09:52:58 reactor.kafka.receiver.KafkaReceiverTest > manualCommitSyncNoPoll PASSED
20-May-2020 09:53:00
20-May-2020 09:53:00 reactor.kafka.receiver.KafkaReceiverTest > transferMessages PASSED
20-May-2020 09:53:00
20-May-2020 09:53:00 reactor.kafka.receiver.KafkaReceiverTest > abortTransaction PASSED
20-May-2020 09:53:10
20-May-2020 09:53:10 reactor.kafka.receiver.KafkaReceiverTest > atleastOnceCommitInterval PASSED
20-May-2020 09:53:11
20-May-2020 09:53:11 reactor.kafka.receiver.KafkaReceiverTest > autoCommitRetry PASSED
20-May-2020 09:53:11
20-May-2020 09:53:11 reactor.kafka.receiver.ReceiverOptionsTest > deserializersAreMaintainedWhenToImmutableIsCalled PASSED
20-May-2020 09:53:11
20-May-2020 09:53:11 reactor.kafka.receiver.internals.KafkaSchedulersTest > checkThatEventSchedulerIdentifiesProducedThreadCorrectly PASSED
20-May-2020 09:53:11
20-May-2020 09:53:11 reactor.kafka.receiver.internals.KafkaSchedulersTest > checkThatWorkerFromEventSchedulerIdentifiesProducedThreadCorrectly PASSED
20-May-2020 09:53:11
20-May-2020 09:53:11 reactor.kafka.receiver.internals.MockReceiverTest > atmostOnceMessageProcessingFailure PASSED
20-May-2020 09:53:12
20-May-2020 09:53:12 reactor.kafka.receiver.internals.MockReceiverTest > manualAckClose PASSED
20-May-2020 09:53:12
20-May-2020 09:53:12 reactor.kafka.receiver.internals.MockReceiverTest > manualCommitSync PASSED
20-May-2020 09:53:12
20-May-2020 09:53:12 reactor.kafka.receiver.internals.MockReceiverTest > manualAssignment PASSED
20-May-2020 09:53:12
20-May-2020 09:53:12 reactor.kafka.receiver.internals.MockReceiverTest > shouldNotOverflowOnLongMaxValuePlus1WhichHappensInCaseOfSkip1 PASSED
20-May-2020 09:53:13
20-May-2020 09:53:13 reactor.kafka.receiver.internals.MockReceiverTest > wildcardSubscription PASSED
20-May-2020 09:53:13
20-May-2020 09:53:13 reactor.kafka.receiver.internals.MockReceiverTest > manualCommitAsyncNoPoll PASSED
20-May-2020 09:53:13
20-May-2020 09:53:13 reactor.kafka.receiver.internals.MockReceiverTest > backPressureReceiveAutoAck PASSED
20-May-2020 09:53:14
20-May-2020 09:53:14 reactor.kafka.receiver.internals.MockReceiverTest > manualAckCommitInterval PASSED
20-May-2020 09:53:14
20-May-2020 09:53:14 reactor.kafka.receiver.internals.MockReceiverTest > atmostOnce PASSED
20-May-2020 09:53:14
20-May-2020 09:53:14 reactor.kafka.receiver.internals.MockReceiverTest > testCorrectResourceDisposeOnAccidentError PASSED
20-May-2020 09:53:14
20-May-2020 09:53:14 reactor.kafka.receiver.internals.MockReceiverTest > testThatDisposeOfResourceOnEventThreadCompleteSuccessful PASSED
20-May-2020 09:53:15
20-May-2020 09:53:15 reactor.kafka.receiver.internals.MockReceiverTest > manualAckCommitIntervalOrBatchSize PASSED
20-May-2020 09:53:15
20-May-2020 09:53:15 reactor.kafka.receiver.internals.MockReceiverTest > seekToBeginning PASSED
20-May-2020 09:53:16
20-May-2020 09:53:16 reactor.kafka.receiver.internals.MockReceiverTest > autoHeartbeat PASSED
20-May-2020 09:53:16
20-May-2020 09:53:16 reactor.kafka.receiver.internals.MockReceiverTest > testCorrectResourceDisposeOnAccidentErrorDuringStart PASSED
20-May-2020 09:53:17
20-May-2020 09:53:17 reactor.kafka.receiver.internals.MockReceiverTest > atmostOnceCommitAttempts PASSED
20-May-2020 09:53:17
20-May-2020 09:53:17 reactor.kafka.receiver.internals.MockReceiverTest > autoAck PASSED
20-May-2020 09:53:17
20-May-2020 09:53:17 reactor.kafka.receiver.internals.MockReceiverTest > autoAckCommitFatalError PASSED
20-May-2020 09:53:17
20-May-2020 09:53:17 reactor.kafka.receiver.internals.MockReceiverTest > backPressureReceiveAtmostOnce PASSED
20-May-2020 09:53:17
20-May-2020 09:53:17 reactor.kafka.receiver.internals.MockReceiverTest > resumeAfterFailure PASSED
20-May-2020 09:53:17
20-May-2020 09:53:17 reactor.kafka.receiver.internals.MockReceiverTest > manualCommitBlockNoPoll PASSED
20-May-2020 09:53:28
20-May-2020 09:53:28 reactor.kafka.receiver.internals.MockReceiverTest > groupByPartitionThreadSharing PASSED
20-May-2020 09:53:28
20-May-2020 09:53:28 reactor.kafka.receiver.internals.MockReceiverTest > manualCommitAttempts PASSED
20-May-2020 09:53:29
20-May-2020 09:53:29 reactor.kafka.receiver.internals.MockReceiverTest > manualCommitAsync PASSED
20-May-2020 09:53:29
20-May-2020 09:53:29 reactor.kafka.receiver.internals.MockReceiverTest > manualCommitClose PASSED
20-May-2020 09:53:30
20-May-2020 09:53:30 reactor.kafka.receiver.internals.MockReceiverTest > manualCommitRetry PASSED
20-May-2020 09:53:30
20-May-2020 09:53:30 reactor.kafka.receiver.internals.MockReceiverTest > manualAck PASSED
20-May-2020 09:53:40
20-May-2020 09:53:40 reactor.kafka.receiver.internals.MockReceiverTest > parallelRoundRobinScheduler PASSED
20-May-2020 09:53:40
20-May-2020 09:53:40 reactor.kafka.receiver.internals.MockReceiverTest > receiveOne PASSED
20-May-2020 09:53:42
20-May-2020 09:53:42 reactor.kafka.receiver.internals.MockReceiverTest > consumerMethods PASSED
20-May-2020 09:53:42
20-May-2020 09:53:42 reactor.kafka.receiver.internals.MockReceiverTest > backPressureReceive PASSED
20-May-2020 09:53:42
20-May-2020 09:53:42 reactor.kafka.receiver.internals.MockReceiverTest > seekToOffset PASSED
20-May-2020 09:53:42
20-May-2020 09:53:42 reactor.kafka.receiver.internals.MockReceiverTest > autoCommitDisable PASSED
20-May-2020 09:53:43
20-May-2020 09:53:43 reactor.kafka.receiver.internals.MockReceiverTest > multipleReceives PASSED
20-May-2020 09:53:43
20-May-2020 09:53:43 reactor.kafka.receiver.internals.MockReceiverTest > manualAckCommitBatchSize PASSED
20-May-2020 09:53:43
20-May-2020 09:53:43 reactor.kafka.receiver.internals.MockReceiverTest > atmostOnceCommitFailure PASSED
20-May-2020 09:53:43
20-May-2020 09:53:43 reactor.kafka.receiver.internals.MockReceiverTest > seekToEnd PASSED
20-May-2020 09:53:44
20-May-2020 09:53:44 reactor.kafka.receiver.internals.MockReceiverTest > autoAckCommitTransientError PASSED
20-May-2020 09:53:44
20-May-2020 09:53:44 reactor.kafka.receiver.internals.MockReceiverTest > assignCallback PASSED
20-May-2020 09:53:44
20-May-2020 09:53:44 reactor.kafka.receiver.internals.MockReceiverTest > messageProcessorFailure PASSED
20-May-2020 09:53:44
20-May-2020 09:53:44 reactor.kafka.receiver.internals.MockReceiverTest > consumerLifecycle PASSED
20-May-2020 09:53:44
20-May-2020 09:53:44 reactor.kafka.receiver.internals.MockReceiverTest > seekFailure PASSED
20-May-2020 09:53:44
20-May-2020 09:53:44 reactor.kafka.receiver.internals.MockReceiverTest > consumerDisallowedMethods PASSED
20-May-2020 09:53:44
20-May-2020 09:53:44 reactor.kafka.receiver.internals.MockReceiverTest > autoAckCommitTransientErrorMaxRetries PASSED
20-May-2020 09:53:45
20-May-2020 09:53:45 reactor.kafka.receiver.internals.MockReceiverTest > manualCommitFailure PASSED
20-May-2020 09:53:45
20-May-2020 09:53:45 reactor.kafka.receiver.internals.MockReceiverTest > atmostOnceCommitAheadSize PASSED
20-May-2020 09:53:45
20-May-2020 09:53:45 reactor.kafka.receiver.internals.MockReceiverTest > autoCommitClose PASSED
20-May-2020 09:53:45
20-May-2020 09:53:45 reactor.kafka.receiver.internals.MockReceiverTest > receiveMultiplePartitions PASSED
20-May-2020 09:53:51
20-May-2020 09:53:51 reactor.kafka.receiver.internals.MockReceiverTest > groupByPartitionElasticScheduling PASSED
20-May-2020 09:53:51
20-May-2020 09:53:51 reactor.kafka.receiver.internals.OperatorUtilsTest > testOperatorsAddBehavior[0] PASSED
20-May-2020 09:53:51
20-May-2020 09:53:51 reactor.kafka.receiver.internals.OperatorUtilsTest > testOperatorsAddBehavior[1] PASSED
20-May-2020 09:53:51
20-May-2020 09:53:51 reactor.kafka.receiver.internals.OperatorUtilsTest > testOperatorsAddBehavior[2] PASSED
20-May-2020 09:53:51
20-May-2020 09:53:51 reactor.kafka.receiver.internals.OperatorUtilsTest > testOperatorsAddBehavior[3] PASSED
20-May-2020 09:53:51
20-May-2020 09:53:51 reactor.kafka.receiver.internals.OperatorUtilsTest > testOperatorsAddBehavior[4] PASSED
20-May-2020 09:53:51
20-May-2020 09:53:51 > Task :jar
20-May-2020 09:53:52 > Task :reactor-kafka-samples:compileJava
20-May-2020 09:53:52 > Task :reactor-kafka-samples:processResources NO-SOURCE
20-May-2020 09:53:52 > Task :reactor-kafka-samples:classes
20-May-2020 09:53:52 > Task :reactor-kafka-samples:checkstyleMain
20-May-2020 09:53:52 > Task :reactor-kafka-samples:compileTestJava
20-May-2020 09:53:52 > Task :reactor-kafka-samples:processTestResources
20-May-2020 09:53:52 > Task :reactor-kafka-samples:testClasses
20-May-2020 09:53:52 > Task :reactor-kafka-samples:checkstyleTest
20-May-2020 09:54:03
20-May-2020 09:54:03 > Task :reactor-kafka-samples:test
20-May-2020 09:54:03
20-May-2020 09:54:03 reactor.kafka.samples.SampleScenariosTest > partition PASSED
20-May-2020 09:54:04
20-May-2020 09:54:04 reactor.kafka.samples.SampleScenariosTest > transactionalSend PASSED
20-May-2020 09:54:04
20-May-2020 09:54:04 reactor.kafka.samples.SampleScenariosTest > fanOut PASSED
20-May-2020 09:54:06
20-May-2020 09:54:06 reactor.kafka.samples.SampleScenariosTest > atmostOnce PASSED
20-May-2020 09:54:10
20-May-2020 09:54:10 reactor.kafka.samples.SampleScenariosTest > kafkaSinkChain PASSED
20-May-2020 09:54:12
20-May-2020 09:54:12 reactor.kafka.samples.SampleScenariosTest > kafkaSource PASSED
20-May-2020 09:54:12
20-May-2020 09:54:12 reactor.kafka.samples.SampleScenariosTest > kafkaSink PASSED
20-May-2020 09:54:13
20-May-2020 09:54:13 reactor.kafka.samples.SampleScenariosTest > exactlyOnceAbort PASSED
20-May-2020 09:54:13
20-May-2020 09:54:13 reactor.kafka.samples.SampleScenariosTest > exactlyOnce PASSED
20-May-2020 09:54:14
20-May-2020 09:54:14 reactor.kafka.samples.SampleScenariosTest > kafkaTransform PASSED
20-May-2020 09:54:14
20-May-2020 09:54:14 reactor.kafka.samples.SampleTest > sampleTest PASSED
20-May-2020 09:54:14
20-May-2020 09:54:14 > Task :reactor-kafka-tools:compileJava
20-May-2020 09:54:14 /opt/bamboo-home/xml-data/build-dir/REACTOR-RKAFKA-AERON/reactor-kafka-tools/src/main/java/reactor/kafka/tools/perf/ConsumerPerformance.java:263: warning: [deprecation] poll(long) in KafkaConsumer has been deprecated
20-May-2020 09:54:14                 consumer.poll(100);
20-May-2020 09:54:14                         ^
20-May-2020 09:54:14   where K,V are type-variables:
20-May-2020 09:54:14     K extends Object declared in class KafkaConsumer
20-May-2020 09:54:14     V extends Object declared in class KafkaConsumer
20-May-2020 09:54:14 /opt/bamboo-home/xml-data/build-dir/REACTOR-RKAFKA-AERON/reactor-kafka-tools/src/main/java/reactor/kafka/tools/perf/ConsumerPerformance.java:273: warning: [deprecation] poll(long) in KafkaConsumer has been deprecated
20-May-2020 09:54:14                 ConsumerRecords<byte[], byte[]> records = consumer.poll(100);
20-May-2020 09:54:14                                                                   ^
20-May-2020 09:54:14   where K,V are type-variables:
20-May-2020 09:54:14     K extends Object declared in class KafkaConsumer
20-May-2020 09:54:14     V extends Object declared in class KafkaConsumer
20-May-2020 09:54:14 /opt/bamboo-home/xml-data/build-dir/REACTOR-RKAFKA-AERON/reactor-kafka-tools/src/main/java/reactor/kafka/tools/perf/EndToEndLatency.java:308: warning: [deprecation] poll(long) in KafkaConsumer has been deprecated
20-May-2020 09:54:14                 consumer.poll(100);
20-May-2020 09:54:14                         ^
20-May-2020 09:54:14   where K,V are type-variables:
20-May-2020 09:54:14     K extends Object declared in class KafkaConsumer
20-May-2020 09:54:14     V extends Object declared in class KafkaConsumer
20-May-2020 09:54:14 /opt/bamboo-home/xml-data/build-dir/REACTOR-RKAFKA-AERON/reactor-kafka-tools/src/main/java/reactor/kafka/tools/perf/EndToEndLatency.java:312: warning: [deprecation] poll(long) in KafkaConsumer has been deprecated
20-May-2020 09:54:14             consumer.poll(0);
20-May-2020 09:54:14                     ^
20-May-2020 09:54:14   where K,V are type-variables:
20-May-2020 09:54:14     K extends Object declared in class KafkaConsumer
20-May-2020 09:54:14     V extends Object declared in class KafkaConsumer
20-May-2020 09:54:14 /opt/bamboo-home/xml-data/build-dir/REACTOR-RKAFKA-AERON/reactor-kafka-tools/src/main/java/reactor/kafka/tools/perf/EndToEndLatency.java:316: warning: [deprecation] poll(long) in KafkaConsumer has been deprecated
20-May-2020 09:54:14             Iterator<ConsumerRecord<byte[], byte[]>> recordIter = consumer.poll(timeout).iterator();
20-May-2020 09:54:14                                                                           ^
20-May-2020 09:54:14   where K,V are type-variables:
20-May-2020 09:54:14     K extends Object declared in class KafkaConsumer
20-May-2020 09:54:14     V extends Object declared in class KafkaConsumer
20-May-2020 09:54:14 5 warnings
20-May-2020 09:54:14
20-May-2020 09:54:14 > Task :reactor-kafka-tools:processResources NO-SOURCE
20-May-2020 09:54:14 > Task :reactor-kafka-tools:classes
20-May-2020 09:54:14 > Task :reactor-kafka-tools:checkstyleMain
20-May-2020 09:54:14 > Task :reactor-kafka-tools:compileTestJava
20-May-2020 09:54:14 > Task :reactor-kafka-tools:processTestResources NO-SOURCE
20-May-2020 09:54:14 > Task :reactor-kafka-tools:testClasses
20-May-2020 09:54:15 > Task :reactor-kafka-tools:checkstyleTest
20-May-2020 09:54:45 > Task :reactor-kafka-tools:test
20-May-2020 09:54:45
20-May-2020 09:54:45 reactor.kafka.tools.perf.EndToEndLatencyTest > performanceRegressionTest PASSED
20-May-2020 09:54:56
20-May-2020 09:54:56 reactor.kafka.tools.perf.ProducerPerformanceTest > performanceRegressionTest PASSED
20-May-2020 09:55:07
20-May-2020 09:55:07 reactor.kafka.tools.perf.ConsumerPerformanceTest > performanceRegressionTest FAILED
20-May-2020 09:55:07     java.lang.AssertionError: Reactive throughput is lower than expected, reactive=1300390.1170351105, nonReactive=3090234.8578491965
20-May-2020 09:55:07         at org.junit.Assert.fail(Assert.java:88)
20-May-2020 09:55:07         at org.junit.Assert.assertTrue(Assert.java:41)
20-May-2020 09:55:07         at reactor.kafka.tools.util.PerfTestUtils.verifyReactiveThroughput(PerfTestUtils.java:30)
20-May-2020 09:55:07         at reactor.kafka.tools.perf.ConsumerPerformanceTest.performanceRegressionTest(ConsumerPerformanceTest.java:61)
20-May-2020 09:55:07
20-May-2020 09:55:07 3 tests completed, 1 failed
20-May-2020 09:55:07
20-May-2020 09:55:07 > Task :reactor-kafka-tools:test FAILED
20-May-2020 09:55:07
20-May-2020 09:55:07 FAILURE: Build failed with an exception.
20-May-2020 09:55:07
20-May-2020 09:55:07 * What went wrong:
20-May-2020 09:55:07 Execution failed for task ':reactor-kafka-tools:test'.
20-May-2020 09:55:07 > There were failing tests. See the report at: file:///opt/bamboo-home/xml-data/build-dir/REACTOR-RKAFKA-AERON/reactor-kafka-tools/build/reports/tests/test/index.html
20-May-2020 09:55:07
20-May-2020 09:55:07 * Try:
20-May-2020 09:55:07 Run with --info or --debug option to get more log output. Run with --scan to get full insights.
20-May-2020 09:55:07
20-May-2020 09:55:07 * Exception is:
20-May-2020 09:55:07 org.gradle.api.tasks.TaskExecutionException: Execution failed for task ':reactor-kafka-tools:test'.
20-May-2020 09:55:07         at org.gradle.api.internal.tasks.execution.ExecuteActionsTaskExecuter$3.accept(ExecuteActionsTaskExecuter.java:166)
20-May-2020 09:55:07         at org.gradle.api.internal.tasks.execution.ExecuteActionsTaskExecuter$3.accept(ExecuteActionsTaskExecuter.java:163)
20-May-2020 09:55:07         at org.gradle.internal.Try$Failure.ifSuccessfulOrElse(Try.java:191)
20-May-2020 09:55:07         at org.gradle.api.internal.tasks.execution.ExecuteActionsTaskExecuter.execute(ExecuteActionsTaskExecuter.java:156)
20-May-2020 09:55:07         at org.gradle.api.internal.tasks.execution.ValidatingTaskExecuter.execute(ValidatingTaskExecuter.java:62)
20-May-2020 09:55:07         at org.gradle.api.internal.tasks.execution.SkipEmptySourceFilesTaskExecuter.execute(SkipEmptySourceFilesTaskExecuter.java:108)
20-May-2020 09:55:07         at org.gradle.api.internal.tasks.execution.ResolveBeforeExecutionOutputsTaskExecuter.execute(ResolveBeforeExecutionOutputsTaskExecuter.java:67)
20-May-2020 09:55:07         at org.gradle.api.internal.tasks.execution.ResolveAfterPreviousExecutionStateTaskExecuter.execute(ResolveAfterPreviousExecutionStateTaskExecuter.java:46)
20-May-2020 09:55:07         at org.gradle.api.internal.tasks.execution.CleanupStaleOutputsExecuter.execute(CleanupStaleOutputsExecuter.java:94)
20-May-2020 09:55:07         at org.gradle.api.internal.tasks.execution.FinalizePropertiesTaskExecuter.execute(FinalizePropertiesTaskExecuter.java:46)
20-May-2020 09:55:07         at org.gradle.api.internal.tasks.execution.ResolveTaskExecutionModeExecuter.execute(ResolveTaskExecutionModeExecuter.java:95)
20-May-2020 09:55:07         at org.gradle.api.internal.tasks.execution.SkipTaskWithNoActionsExecuter.execute(SkipTaskWithNoActionsExecuter.java:57)
20-May-2020 09:55:07         at org.gradle.api.internal.tasks.execution.SkipOnlyIfTaskExecuter.execute(SkipOnlyIfTaskExecuter.java:56)
20-May-2020 09:55:07         at org.gradle.api.internal.tasks.execution.CatchExceptionTaskExecuter.execute(CatchExceptionTaskExecuter.java:36)
20-May-2020 09:55:07         at org.gradle.api.internal.tasks.execution.EventFiringTaskExecuter$1.executeTask(EventFiringTaskExecuter.java:77)
20-May-2020 09:55:07         at org.gradle.api.internal.tasks.execution.EventFiringTaskExecuter$1.call(EventFiringTaskExecuter.java:55)
20-May-2020 09:55:07         at org.gradle.api.internal.tasks.execution.EventFiringTaskExecuter$1.call(EventFiringTaskExecuter.java:52)
20-May-2020 09:55:07         at org.gradle.internal.operations.DefaultBuildOperationExecutor$CallableBuildOperationWorker.execute(DefaultBuildOperationExecutor.java:416)
20-May-2020 09:55:07         at org.gradle.internal.operations.DefaultBuildOperationExecutor$CallableBuildOperationWorker.execute(DefaultBuildOperationExecutor.java:406)
20-May-2020 09:55:07         at org.gradle.internal.operations.DefaultBuildOperationExecutor$1.execute(DefaultBuildOperationExecutor.java:165)
20-May-2020 09:55:07         at org.gradle.internal.operations.DefaultBuildOperationExecutor.execute(DefaultBuildOperationExecutor.java:250)
20-May-2020 09:55:07         at org.gradle.internal.operations.DefaultBuildOperationExecutor.execute(DefaultBuildOperationExecutor.java:158)
20-May-2020 09:55:07         at org.gradle.internal.operations.DefaultBuildOperationExecutor.call(DefaultBuildOperationExecutor.java:102)
20-May-2020 09:55:07         at org.gradle.internal.operations.DelegatingBuildOperationExecutor.call(DelegatingBuildOperationExecutor.java:36)
20-May-2020 09:55:07         at org.gradle.api.internal.tasks.execution.EventFiringTaskExecuter.execute(EventFiringTaskExecuter.java:52)
20-May-2020 09:55:07         at org.gradle.execution.plan.LocalTaskNodeExecutor.execute(LocalTaskNodeExecutor.java:43)
20-May-2020 09:55:07         at org.gradle.execution.taskgraph.DefaultTaskExecutionGraph$InvokeNodeExecutorsAction.execute(DefaultTaskExecutionGraph.java:355)
20-May-2020 09:55:07         at org.gradle.execution.taskgraph.DefaultTaskExecutionGraph$InvokeNodeExecutorsAction.execute(DefaultTaskExecutionGraph.java:343)
20-May-2020 09:55:07         at org.gradle.execution.taskgraph.DefaultTaskExecutionGraph$BuildOperationAwareExecutionAction.execute(DefaultTaskExecutionGraph.java:336)
20-May-2020 09:55:07         at org.gradle.execution.taskgraph.DefaultTaskExecutionGraph$BuildOperationAwareExecutionAction.execute(DefaultTaskExecutionGraph.java:322)
20-May-2020 09:55:07         at org.gradle.execution.plan.DefaultPlanExecutor$ExecutorWorker$1.execute(DefaultPlanExecutor.java:134)
20-May-2020 09:55:07         at org.gradle.execution.plan.DefaultPlanExecutor$ExecutorWorker$1.execute(DefaultPlanExecutor.java:129)
20-May-2020 09:55:07         at org.gradle.execution.plan.DefaultPlanExecutor$ExecutorWorker.execute(DefaultPlanExecutor.java:202)
20-May-2020 09:55:07         at org.gradle.execution.plan.DefaultPlanExecutor$ExecutorWorker.executeNextNode(DefaultPlanExecutor.java:193)
20-May-2020 09:55:07         at org.gradle.execution.plan.DefaultPlanExecutor$ExecutorWorker.run(DefaultPlanExecutor.java:129)
20-May-2020 09:55:07         at org.gradle.internal.concurrent.ExecutorPolicy$CatchAndRecordFailures.onExecute(ExecutorPolicy.java:64)
20-May-2020 09:55:07         at org.gradle.internal.concurrent.ManagedExecutorImpl$1.run(ManagedExecutorImpl.java:48)
20-May-2020 09:55:07         at org.gradle.internal.concurrent.ThreadFactoryImpl$ManagedThreadRunnable.run(ThreadFactoryImpl.java:56)
20-May-2020 09:55:07 Caused by: org.gradle.api.GradleException: There were failing tests. See the report at: file:///opt/bamboo-home/xml-data/build-dir/REACTOR-RKAFKA-AERON/reactor-kafka-tools/build/reports/tests/test/index.html
20-May-2020 09:55:07         at org.gradle.api.tasks.testing.AbstractTestTask.handleTestFailures(AbstractTestTask.java:632)
20-May-2020 09:55:07         at org.gradle.api.tasks.testing.AbstractTestTask.executeTests(AbstractTestTask.java:501)
20-May-2020 09:55:07         at org.gradle.api.tasks.testing.Test.executeTests(Test.java:613)
20-May-2020 09:55:07         at org.gradle.internal.reflect.JavaMethod.invoke(JavaMethod.java:103)
20-May-2020 09:55:07         at org.gradle.api.internal.project.taskfactory.StandardTaskAction.doExecute(StandardTaskAction.java:49)
20-May-2020 09:55:07         at org.gradle.api.internal.project.taskfactory.StandardTaskAction.execute(StandardTaskAction.java:42)
20-May-2020 09:55:07         at org.gradle.api.internal.project.taskfactory.StandardTaskAction.execute(StandardTaskAction.java:28)
20-May-2020 09:55:07         at org.gradle.api.internal.AbstractTask$TaskActionWrapper.execute(AbstractTask.java:717)
20-May-2020 09:55:07         at org.gradle.api.internal.AbstractTask$TaskActionWrapper.execute(AbstractTask.java:684)
20-May-2020 09:55:07         at org.gradle.api.internal.tasks.execution.ExecuteActionsTaskExecuter$5.run(ExecuteActionsTaskExecuter.java:476)
20-May-2020 09:55:07         at org.gradle.internal.operations.DefaultBuildOperationExecutor$RunnableBuildOperationWorker.execute(DefaultBuildOperationExecutor.java:402)
20-May-2020 09:55:07         at org.gradle.internal.operations.DefaultBuildOperationExecutor$RunnableBuildOperationWorker.execute(DefaultBuildOperationExecutor.java:394)
20-May-2020 09:55:07         at org.gradle.internal.operations.DefaultBuildOperationExecutor$1.execute(DefaultBuildOperationExecutor.java:165)
20-May-2020 09:55:07         at org.gradle.internal.operations.DefaultBuildOperationExecutor.execute(DefaultBuildOperationExecutor.java:250)
20-May-2020 09:55:07         at org.gradle.internal.operations.DefaultBuildOperationExecutor.execute(DefaultBuildOperationExecutor.java:158)
20-May-2020 09:55:07         at org.gradle.internal.operations.DefaultBuildOperationExecutor.run(DefaultBuildOperationExecutor.java:92)
20-May-2020 09:55:07         at org.gradle.internal.operations.DelegatingBuildOperationExecutor.run(DelegatingBuildOperationExecutor.java:31)
20-May-2020 09:55:07         at org.gradle.api.internal.tasks.execution.ExecuteActionsTaskExecuter.executeAction(ExecuteActionsTaskExecuter.java:461)
20-May-2020 09:55:07         at org.gradle.api.internal.tasks.execution.ExecuteActionsTaskExecuter.executeActions(ExecuteActionsTaskExecuter.java:444)
20-May-2020 09:55:07         at org.gradle.api.internal.tasks.execution.ExecuteActionsTaskExecuter.access$200(ExecuteActionsTaskExecuter.java:93)
20-May-2020 09:55:07         at org.gradle.api.internal.tasks.execution.ExecuteActionsTaskExecuter$TaskExecution.execute(ExecuteActionsTaskExecuter.java:237)
20-May-2020 09:55:07         at org.gradle.internal.execution.steps.ExecuteStep.lambda$execute$1(ExecuteStep.java:33)
20-May-2020 09:55:07         at org.gradle.internal.execution.steps.ExecuteStep.execute(ExecuteStep.java:33)
20-May-2020 09:55:07         at org.gradle.internal.execution.steps.ExecuteStep.execute(ExecuteStep.java:26)
20-May-2020 09:55:07         at org.gradle.internal.execution.steps.CleanupOutputsStep.execute(CleanupOutputsStep.java:58)
20-May-2020 09:55:07         at org.gradle.internal.execution.steps.CleanupOutputsStep.execute(CleanupOutputsStep.java:35)
20-May-2020 09:55:07         at org.gradle.internal.execution.steps.ResolveInputChangesStep.execute(ResolveInputChangesStep.java:48)
20-May-2020 09:55:07         at org.gradle.internal.execution.steps.ResolveInputChangesStep.execute(ResolveInputChangesStep.java:33)
20-May-2020 09:55:07         at org.gradle.internal.execution.steps.CancelExecutionStep.execute(CancelExecutionStep.java:39)
20-May-2020 09:55:07         at org.gradle.internal.execution.steps.TimeoutStep.executeWithoutTimeout(TimeoutStep.java:73)
20-May-2020 09:55:07         at org.gradle.internal.execution.steps.TimeoutStep.execute(TimeoutStep.java:54)
20-May-2020 09:55:07         at org.gradle.internal.execution.steps.CatchExceptionStep.execute(CatchExceptionStep.java:35)
20-May-2020 09:55:07         at org.gradle.internal.execution.steps.CreateOutputsStep.execute(CreateOutputsStep.java:51)
20-May-2020 09:55:07         at org.gradle.internal.execution.steps.SnapshotOutputsStep.execute(SnapshotOutputsStep.java:45)
20-May-2020 09:55:07         at org.gradle.internal.execution.steps.SnapshotOutputsStep.execute(SnapshotOutputsStep.java:31)
20-May-2020 09:55:07         at org.gradle.internal.execution.steps.CacheStep.executeWithoutCache(CacheStep.java:208)
20-May-2020 09:55:07         at org.gradle.internal.execution.steps.CacheStep.execute(CacheStep.java:70)
20-May-2020 09:55:07         at org.gradle.internal.execution.steps.CacheStep.execute(CacheStep.java:45)
20-May-2020 09:55:07         at org.gradle.internal.execution.steps.BroadcastChangingOutputsStep.execute(BroadcastChangingOutputsStep.java:49)
20-May-2020 09:55:07         at org.gradle.internal.execution.steps.StoreSnapshotsStep.execute(StoreSnapshotsStep.java:43)
20-May-2020 09:55:07         at org.gradle.internal.execution.steps.StoreSnapshotsStep.execute(StoreSnapshotsStep.java:32)
20-May-2020 09:55:07         at org.gradle.internal.execution.steps.RecordOutputsStep.execute(RecordOutputsStep.java:38)
20-May-2020 09:55:07         at org.gradle.internal.execution.steps.RecordOutputsStep.execute(RecordOutputsStep.java:24)
20-May-2020 09:55:07         at org.gradle.internal.execution.steps.SkipUpToDateStep.executeBecause(SkipUpToDateStep.java:96)
20-May-2020 09:55:07         at org.gradle.internal.execution.steps.SkipUpToDateStep.lambda$execute$0(SkipUpToDateStep.java:89)
20-May-2020 09:55:07         at org.gradle.internal.execution.steps.SkipUpToDateStep.execute(SkipUpToDateStep.java:54)
20-May-2020 09:55:07         at org.gradle.internal.execution.steps.SkipUpToDateStep.execute(SkipUpToDateStep.java:38)
20-May-2020 09:55:07         at org.gradle.internal.execution.steps.ResolveChangesStep.execute(ResolveChangesStep.java:76)
20-May-2020 09:55:07         at org.gradle.internal.execution.steps.ResolveChangesStep.execute(ResolveChangesStep.java:37)
20-May-2020 09:55:07         at org.gradle.internal.execution.steps.legacy.MarkSnapshottingInputsFinishedStep.execute(MarkSnapshottingInputsFinishedStep.java:36)
20-May-2020 09:55:07         at org.gradle.internal.execution.steps.legacy.MarkSnapshottingInputsFinishedStep.execute(MarkSnapshottingInputsFinishedStep.java:26)
20-May-2020 09:55:07         at org.gradle.internal.execution.steps.ResolveCachingStateStep.execute(ResolveCachingStateStep.java:90)
20-May-2020 09:55:07         at org.gradle.internal.execution.steps.ResolveCachingStateStep.execute(ResolveCachingStateStep.java:48)
20-May-2020 09:55:07         at org.gradle.internal.execution.steps.CaptureStateBeforeExecutionStep.execute(CaptureStateBeforeExecutionStep.java:69)
20-May-2020 09:55:07         at org.gradle.internal.execution.steps.CaptureStateBeforeExecutionStep.execute(CaptureStateBeforeExecutionStep.java:47)
20-May-2020 09:55:07         at org.gradle.internal.execution.impl.DefaultWorkExecutor.execute(DefaultWorkExecutor.java:33)
20-May-2020 09:55:07         at org.gradle.api.internal.tasks.execution.ExecuteActionsTaskExecuter.execute(ExecuteActionsTaskExecuter.java:140)
20-May-2020 09:55:07         ... 34 more
20-May-2020 09:55:07
20-May-2020 09:55:07
20-May-2020 09:55:07 * Get more help at https://help.gradle.org
20-May-2020 09:55:07
20-May-2020 09:55:07 BUILD FAILED in 6m 31s
20-May-2020 09:55:07
20-May-2020 09:55:07 Deprecated Gradle features were used in this build, making it incompatible with Gradle 6.0.
20-May-2020 09:55:07 Use '--warning-mode all' to show the individual deprecation warnings.
20-May-2020 09:55:07 See https://docs.gradle.org/5.6.4/userguide/command_line_interface.html#sec:command_line_warnings
20-May-2020 09:55:07 21 actionable tasks: 18 executed, 3 up-to-date
20-May-2020 09:55:07
20-May-2020 09:55:07 Failing task since return code of [./gradlew --stacktrace clean test assemble -DbuildInfoConfig.propertiesFile=/tmp/buildinfo2867048793822939031properties artifactoryPublish -Dartifactory.resolve.password=******** -Dartifactory.publish.password=********] was 1 while expected 0
20-May-2020 09:55:07 Parsing test results under /opt/bamboo-home/xml-data/build-dir/REACTOR-RKAFKA-AERON...
20-May-2020 09:55:07 Finished task 'Build Test Assemble' with result: Failed
20-May-2020 09:55:07 Running post build plugin 'Docker Container Cleanup'
20-May-2020 09:55:07 Running post build plugin 'NCover Results Collector'
20-May-2020 09:55:07 Running post build plugin 'Artifactory Release Management Staging'
20-May-2020 09:55:07 Running post build plugin 'Artifactory Build Info Copier'
20-May-2020 09:55:07 Running post build plugin 'Artifactory Gradle Properties Info Copier'
20-May-2020 09:55:07 Running post build plugin 'Clover Results Collector'
20-May-2020 09:55:07 Running post build plugin 'npm Cache Cleanup'
20-May-2020 09:55:07 Running post build plugin 'Artifact Copier'
20-May-2020 09:55:07 Publishing an artifact: test-report
20-May-2020 09:55:07 Finished publishing of artifact Non required job artifact: [test-report], pattern: [**/build/reports/tests/**] in 51.56 ms
20-May-2020 09:55:07 Successfully removed working directory at '/opt/bamboo-home/xml-data/build-dir/REACTOR-RKAFKA-AERON'
20-May-2020 09:55:07 Finalising the build...
20-May-2020 09:55:07 Stopping timer.
20-May-2020 09:55:07 Build REACTOR-RKAFKA-AERON-869 completed.
20-May-2020 09:55:07 Running on server: post build plugin 'NCover Results Collector'
20-May-2020 09:55:07 Running on server: post build plugin 'Build Hanging Detection Configuration'
20-May-2020 09:55:07 Running on server: post build plugin 'Bamboo project link creator'
20-May-2020 09:55:07 Running on server: post build plugin 'Clover Delta Calculator'
20-May-2020 09:55:07 Running on server: post build plugin 'Maven Dependencies Postprocessor'
20-May-2020 09:55:07 All post build plugins have finished
20-May-2020 09:55:07 Generating build results summary...
20-May-2020 09:55:07 Saving build results to disk...
20-May-2020 09:55:07 Logging substituted variables...
20-May-2020 09:55:07 Indexing build results...
20-May-2020 09:55:07 Finished building REACTOR-RKAFKA-AERON-869.