Build #919

Build: #919 failed

Job: Kafka failed

Stages & jobs

  1. Default Stage

Job result summary

Completed
Duration
1 minute
Agent
bamboo-22.af.pivotal.io
Revision
4018eaa273fb49ca8c2c042db6120f9bd01f9c0b 4018eaa273fb49ca8c2c042db6120f9bd01f9c0b
Total tests
150
Fixed in
#921 (Code changes detected)

Tests

  • 150 tests in total
  • 62 tests failed
  • 54 failures are new
  • 48 seconds taken in total.
New test failures 54
Status Test Duration
Collapse Failed KafkaReceiverTest abortTransaction History
< 1 sec
org.testcontainers.containers.ContainerLaunchException: org.testcontainers.containers.ContainerLaunchException: Container startup failed
org.testcontainers.containers.ContainerLaunchException: Container startup failed
	at org.testcontainers.containers.GenericContainer.doStart(GenericContainer.java:331)
	at org.testcontainers.containers.KafkaContainer.doStart(KafkaContainer.java:97)
	at org.testcontainers.containers.GenericContainer.start(GenericContainer.java:312)
	at reactor.kafka.AbstractKafkaTest.setUpAbstractKafkaTest(AbstractKafkaTest.java:92)
	at sun.reflect.GeneratedMethodAccessor3.invoke(Unknown Source)
	at sun.reflect.DelegatingMethodAccessorImpl.invoke(DelegatingMethodAccessorImpl.java:43)
(81 more lines...)
Collapse Failed KafkaReceiverTest atleastOnceClose History
< 1 sec
org.testcontainers.containers.ContainerLaunchException: org.testcontainers.containers.ContainerLaunchException: Container startup failed
org.testcontainers.containers.ContainerLaunchException: Container startup failed
	at org.testcontainers.containers.GenericContainer.doStart(GenericContainer.java:331)
	at org.testcontainers.containers.KafkaContainer.doStart(KafkaContainer.java:97)
	at org.testcontainers.containers.GenericContainer.start(GenericContainer.java:312)
	at reactor.kafka.AbstractKafkaTest.setUpAbstractKafkaTest(AbstractKafkaTest.java:92)
	at sun.reflect.GeneratedMethodAccessor3.invoke(Unknown Source)
	at sun.reflect.DelegatingMethodAccessorImpl.invoke(DelegatingMethodAccessorImpl.java:43)
(81 more lines...)
Collapse Failed KafkaReceiverTest atleastOnceCommitBatchSize History
< 1 sec
org.testcontainers.containers.ContainerLaunchException: org.testcontainers.containers.ContainerLaunchException: Container startup failed
org.testcontainers.containers.ContainerLaunchException: Container startup failed
	at org.testcontainers.containers.GenericContainer.doStart(GenericContainer.java:331)
	at org.testcontainers.containers.KafkaContainer.doStart(KafkaContainer.java:97)
	at org.testcontainers.containers.GenericContainer.start(GenericContainer.java:312)
	at reactor.kafka.AbstractKafkaTest.setUpAbstractKafkaTest(AbstractKafkaTest.java:92)
	at sun.reflect.GeneratedMethodAccessor3.invoke(Unknown Source)
	at sun.reflect.DelegatingMethodAccessorImpl.invoke(DelegatingMethodAccessorImpl.java:43)
(81 more lines...)
Collapse Failed KafkaReceiverTest atleastOnceCommitInterval History
< 1 sec
org.testcontainers.containers.ContainerLaunchException: org.testcontainers.containers.ContainerLaunchException: Container startup failed
org.testcontainers.containers.ContainerLaunchException: Container startup failed
	at org.testcontainers.containers.GenericContainer.doStart(GenericContainer.java:331)
	at org.testcontainers.containers.KafkaContainer.doStart(KafkaContainer.java:97)
	at org.testcontainers.containers.GenericContainer.start(GenericContainer.java:312)
	at reactor.kafka.AbstractKafkaTest.setUpAbstractKafkaTest(AbstractKafkaTest.java:92)
	at sun.reflect.GeneratedMethodAccessor3.invoke(Unknown Source)
	at sun.reflect.DelegatingMethodAccessorImpl.invoke(DelegatingMethodAccessorImpl.java:43)
(81 more lines...)
Collapse Failed KafkaReceiverTest atleastOnceCommitRecord History
< 1 sec
org.testcontainers.containers.ContainerLaunchException: org.testcontainers.containers.ContainerLaunchException: Container startup failed
org.testcontainers.containers.ContainerLaunchException: Container startup failed
	at org.testcontainers.containers.GenericContainer.doStart(GenericContainer.java:331)
	at org.testcontainers.containers.KafkaContainer.doStart(KafkaContainer.java:97)
	at org.testcontainers.containers.GenericContainer.start(GenericContainer.java:312)
	at reactor.kafka.AbstractKafkaTest.setUpAbstractKafkaTest(AbstractKafkaTest.java:92)
	at sun.reflect.GeneratedMethodAccessor3.invoke(Unknown Source)
	at sun.reflect.DelegatingMethodAccessorImpl.invoke(DelegatingMethodAccessorImpl.java:43)
(81 more lines...)
Collapse Failed KafkaReceiverTest atmostOnce History
< 1 sec
org.testcontainers.containers.ContainerLaunchException: org.testcontainers.containers.ContainerLaunchException: Container startup failed
org.testcontainers.containers.ContainerLaunchException: Container startup failed
	at org.testcontainers.containers.GenericContainer.doStart(GenericContainer.java:331)
	at org.testcontainers.containers.KafkaContainer.doStart(KafkaContainer.java:97)
	at org.testcontainers.containers.GenericContainer.start(GenericContainer.java:312)
	at reactor.kafka.AbstractKafkaTest.setUpAbstractKafkaTest(AbstractKafkaTest.java:92)
	at sun.reflect.GeneratedMethodAccessor3.invoke(Unknown Source)
	at sun.reflect.DelegatingMethodAccessorImpl.invoke(DelegatingMethodAccessorImpl.java:43)
(81 more lines...)
Collapse Failed KafkaReceiverTest autoAck History
< 1 sec
org.testcontainers.containers.ContainerLaunchException: org.testcontainers.containers.ContainerLaunchException: Container startup failed
org.testcontainers.containers.ContainerLaunchException: Container startup failed
	at org.testcontainers.containers.GenericContainer.doStart(GenericContainer.java:331)
	at org.testcontainers.containers.KafkaContainer.doStart(KafkaContainer.java:97)
	at org.testcontainers.containers.GenericContainer.start(GenericContainer.java:312)
	at reactor.kafka.AbstractKafkaTest.setUpAbstractKafkaTest(AbstractKafkaTest.java:92)
	at sun.reflect.GeneratedMethodAccessor3.invoke(Unknown Source)
	at sun.reflect.DelegatingMethodAccessorImpl.invoke(DelegatingMethodAccessorImpl.java:43)
(81 more lines...)
Collapse Failed KafkaReceiverTest autoCommitFailurePropagationAfterRetries History
< 1 sec
org.testcontainers.containers.ContainerLaunchException: org.testcontainers.containers.ContainerLaunchException: Container startup failed
org.testcontainers.containers.ContainerLaunchException: Container startup failed
	at org.testcontainers.containers.GenericContainer.doStart(GenericContainer.java:331)
	at org.testcontainers.containers.KafkaContainer.doStart(KafkaContainer.java:97)
	at org.testcontainers.containers.GenericContainer.start(GenericContainer.java:312)
	at reactor.kafka.AbstractKafkaTest.setUpAbstractKafkaTest(AbstractKafkaTest.java:92)
	at sun.reflect.GeneratedMethodAccessor3.invoke(Unknown Source)
	at sun.reflect.DelegatingMethodAccessorImpl.invoke(DelegatingMethodAccessorImpl.java:43)
(81 more lines...)
Collapse Failed KafkaReceiverTest autoCommitNonRetriableException History
< 1 sec
org.testcontainers.containers.ContainerLaunchException: org.testcontainers.containers.ContainerLaunchException: Container startup failed
org.testcontainers.containers.ContainerLaunchException: Container startup failed
	at org.testcontainers.containers.GenericContainer.doStart(GenericContainer.java:331)
	at org.testcontainers.containers.KafkaContainer.doStart(KafkaContainer.java:97)
	at org.testcontainers.containers.GenericContainer.start(GenericContainer.java:312)
	at reactor.kafka.AbstractKafkaTest.setUpAbstractKafkaTest(AbstractKafkaTest.java:92)
	at sun.reflect.GeneratedMethodAccessor3.invoke(Unknown Source)
	at sun.reflect.DelegatingMethodAccessorImpl.invoke(DelegatingMethodAccessorImpl.java:43)
(81 more lines...)
Collapse Failed KafkaReceiverTest autoCommitRetry History
< 1 sec
org.testcontainers.containers.ContainerLaunchException: org.testcontainers.containers.ContainerLaunchException: Container startup failed
org.testcontainers.containers.ContainerLaunchException: Container startup failed
	at org.testcontainers.containers.GenericContainer.doStart(GenericContainer.java:331)
	at org.testcontainers.containers.KafkaContainer.doStart(KafkaContainer.java:97)
	at org.testcontainers.containers.GenericContainer.start(GenericContainer.java:312)
	at reactor.kafka.AbstractKafkaTest.setUpAbstractKafkaTest(AbstractKafkaTest.java:92)
	at sun.reflect.GeneratedMethodAccessor3.invoke(Unknown Source)
	at sun.reflect.DelegatingMethodAccessorImpl.invoke(DelegatingMethodAccessorImpl.java:43)
(81 more lines...)
Collapse Failed KafkaReceiverTest consumerClose History
< 1 sec
org.testcontainers.containers.ContainerLaunchException: org.testcontainers.containers.ContainerLaunchException: Container startup failed
org.testcontainers.containers.ContainerLaunchException: Container startup failed
	at org.testcontainers.containers.GenericContainer.doStart(GenericContainer.java:331)
	at org.testcontainers.containers.KafkaContainer.doStart(KafkaContainer.java:97)
	at org.testcontainers.containers.GenericContainer.start(GenericContainer.java:312)
	at reactor.kafka.AbstractKafkaTest.setUpAbstractKafkaTest(AbstractKafkaTest.java:92)
	at sun.reflect.GeneratedMethodAccessor3.invoke(Unknown Source)
	at sun.reflect.DelegatingMethodAccessorImpl.invoke(DelegatingMethodAccessorImpl.java:43)
(81 more lines...)
Collapse Failed KafkaReceiverTest groupByPartition History
< 1 sec
org.testcontainers.containers.ContainerLaunchException: org.testcontainers.containers.ContainerLaunchException: Container startup failed
org.testcontainers.containers.ContainerLaunchException: Container startup failed
	at org.testcontainers.containers.GenericContainer.doStart(GenericContainer.java:331)
	at org.testcontainers.containers.KafkaContainer.doStart(KafkaContainer.java:97)
	at org.testcontainers.containers.GenericContainer.start(GenericContainer.java:312)
	at reactor.kafka.AbstractKafkaTest.setUpAbstractKafkaTest(AbstractKafkaTest.java:92)
	at sun.reflect.GeneratedMethodAccessor3.invoke(Unknown Source)
	at sun.reflect.DelegatingMethodAccessorImpl.invoke(DelegatingMethodAccessorImpl.java:43)
(81 more lines...)
Collapse Failed KafkaReceiverTest manualAssignment History
< 1 sec
org.testcontainers.containers.ContainerLaunchException: org.testcontainers.containers.ContainerLaunchException: Container startup failed
org.testcontainers.containers.ContainerLaunchException: Container startup failed
	at org.testcontainers.containers.GenericContainer.doStart(GenericContainer.java:331)
	at org.testcontainers.containers.KafkaContainer.doStart(KafkaContainer.java:97)
	at org.testcontainers.containers.GenericContainer.start(GenericContainer.java:312)
	at reactor.kafka.AbstractKafkaTest.setUpAbstractKafkaTest(AbstractKafkaTest.java:92)
	at sun.reflect.GeneratedMethodAccessor3.invoke(Unknown Source)
	at sun.reflect.DelegatingMethodAccessorImpl.invoke(DelegatingMethodAccessorImpl.java:43)
(81 more lines...)
Collapse Failed KafkaReceiverTest manualAssignmentListeners History
< 1 sec
org.testcontainers.containers.ContainerLaunchException: org.testcontainers.containers.ContainerLaunchException: Container startup failed
org.testcontainers.containers.ContainerLaunchException: Container startup failed
	at org.testcontainers.containers.GenericContainer.doStart(GenericContainer.java:331)
	at org.testcontainers.containers.KafkaContainer.doStart(KafkaContainer.java:97)
	at org.testcontainers.containers.GenericContainer.start(GenericContainer.java:312)
	at reactor.kafka.AbstractKafkaTest.setUpAbstractKafkaTest(AbstractKafkaTest.java:92)
	at sun.reflect.GeneratedMethodAccessor3.invoke(Unknown Source)
	at sun.reflect.DelegatingMethodAccessorImpl.invoke(DelegatingMethodAccessorImpl.java:43)
(81 more lines...)
Collapse Failed KafkaReceiverTest manualAssignmentWithCommit History
< 1 sec
org.testcontainers.containers.ContainerLaunchException: org.testcontainers.containers.ContainerLaunchException: Container startup failed
org.testcontainers.containers.ContainerLaunchException: Container startup failed
	at org.testcontainers.containers.GenericContainer.doStart(GenericContainer.java:331)
	at org.testcontainers.containers.KafkaContainer.doStart(KafkaContainer.java:97)
	at org.testcontainers.containers.GenericContainer.start(GenericContainer.java:312)
	at reactor.kafka.AbstractKafkaTest.setUpAbstractKafkaTest(AbstractKafkaTest.java:92)
	at sun.reflect.GeneratedMethodAccessor3.invoke(Unknown Source)
	at sun.reflect.DelegatingMethodAccessorImpl.invoke(DelegatingMethodAccessorImpl.java:43)
(81 more lines...)
Collapse Failed KafkaReceiverTest manualCommitAsyncNoPoll History
< 1 sec
org.testcontainers.containers.ContainerLaunchException: org.testcontainers.containers.ContainerLaunchException: Container startup failed
org.testcontainers.containers.ContainerLaunchException: Container startup failed
	at org.testcontainers.containers.GenericContainer.doStart(GenericContainer.java:331)
	at org.testcontainers.containers.KafkaContainer.doStart(KafkaContainer.java:97)
	at org.testcontainers.containers.GenericContainer.start(GenericContainer.java:312)
	at reactor.kafka.AbstractKafkaTest.setUpAbstractKafkaTest(AbstractKafkaTest.java:92)
	at sun.reflect.GeneratedMethodAccessor3.invoke(Unknown Source)
	at sun.reflect.DelegatingMethodAccessorImpl.invoke(DelegatingMethodAccessorImpl.java:43)
(81 more lines...)
Collapse Failed KafkaReceiverTest manualCommitBatch History
< 1 sec
org.testcontainers.containers.ContainerLaunchException: org.testcontainers.containers.ContainerLaunchException: Container startup failed
org.testcontainers.containers.ContainerLaunchException: Container startup failed
	at org.testcontainers.containers.GenericContainer.doStart(GenericContainer.java:331)
	at org.testcontainers.containers.KafkaContainer.doStart(KafkaContainer.java:97)
	at org.testcontainers.containers.GenericContainer.start(GenericContainer.java:312)
	at reactor.kafka.AbstractKafkaTest.setUpAbstractKafkaTest(AbstractKafkaTest.java:92)
	at sun.reflect.GeneratedMethodAccessor3.invoke(Unknown Source)
	at sun.reflect.DelegatingMethodAccessorImpl.invoke(DelegatingMethodAccessorImpl.java:43)
(81 more lines...)
Collapse Failed KafkaReceiverTest manualCommitFailure History
< 1 sec
org.testcontainers.containers.ContainerLaunchException: org.testcontainers.containers.ContainerLaunchException: Container startup failed
org.testcontainers.containers.ContainerLaunchException: Container startup failed
	at org.testcontainers.containers.GenericContainer.doStart(GenericContainer.java:331)
	at org.testcontainers.containers.KafkaContainer.doStart(KafkaContainer.java:97)
	at org.testcontainers.containers.GenericContainer.start(GenericContainer.java:312)
	at reactor.kafka.AbstractKafkaTest.setUpAbstractKafkaTest(AbstractKafkaTest.java:92)
	at sun.reflect.GeneratedMethodAccessor3.invoke(Unknown Source)
	at sun.reflect.DelegatingMethodAccessorImpl.invoke(DelegatingMethodAccessorImpl.java:43)
(81 more lines...)
Collapse Failed KafkaReceiverTest manualCommitNonRetriableException History
< 1 sec
org.testcontainers.containers.ContainerLaunchException: org.testcontainers.containers.ContainerLaunchException: Container startup failed
org.testcontainers.containers.ContainerLaunchException: Container startup failed
	at org.testcontainers.containers.GenericContainer.doStart(GenericContainer.java:331)
	at org.testcontainers.containers.KafkaContainer.doStart(KafkaContainer.java:97)
	at org.testcontainers.containers.GenericContainer.start(GenericContainer.java:312)
	at reactor.kafka.AbstractKafkaTest.setUpAbstractKafkaTest(AbstractKafkaTest.java:92)
	at sun.reflect.GeneratedMethodAccessor3.invoke(Unknown Source)
	at sun.reflect.DelegatingMethodAccessorImpl.invoke(DelegatingMethodAccessorImpl.java:43)
(81 more lines...)
Collapse Failed KafkaReceiverTest manualCommitRecordAsync History
< 1 sec
org.testcontainers.containers.ContainerLaunchException: org.testcontainers.containers.ContainerLaunchException: Container startup failed
org.testcontainers.containers.ContainerLaunchException: Container startup failed
	at org.testcontainers.containers.GenericContainer.doStart(GenericContainer.java:331)
	at org.testcontainers.containers.KafkaContainer.doStart(KafkaContainer.java:97)
	at org.testcontainers.containers.GenericContainer.start(GenericContainer.java:312)
	at reactor.kafka.AbstractKafkaTest.setUpAbstractKafkaTest(AbstractKafkaTest.java:92)
	at sun.reflect.GeneratedMethodAccessor3.invoke(Unknown Source)
	at sun.reflect.DelegatingMethodAccessorImpl.invoke(DelegatingMethodAccessorImpl.java:43)
(81 more lines...)
Collapse Failed KafkaReceiverTest manualCommitRetry History
< 1 sec
org.testcontainers.containers.ContainerLaunchException: org.testcontainers.containers.ContainerLaunchException: Container startup failed
org.testcontainers.containers.ContainerLaunchException: Container startup failed
	at org.testcontainers.containers.GenericContainer.doStart(GenericContainer.java:331)
	at org.testcontainers.containers.KafkaContainer.doStart(KafkaContainer.java:97)
	at org.testcontainers.containers.GenericContainer.start(GenericContainer.java:312)
	at reactor.kafka.AbstractKafkaTest.setUpAbstractKafkaTest(AbstractKafkaTest.java:92)
	at sun.reflect.GeneratedMethodAccessor3.invoke(Unknown Source)
	at sun.reflect.DelegatingMethodAccessorImpl.invoke(DelegatingMethodAccessorImpl.java:43)
(81 more lines...)
Collapse Failed KafkaReceiverTest manualCommitSync History
< 1 sec
org.testcontainers.containers.ContainerLaunchException: org.testcontainers.containers.ContainerLaunchException: Container startup failed
org.testcontainers.containers.ContainerLaunchException: Container startup failed
	at org.testcontainers.containers.GenericContainer.doStart(GenericContainer.java:331)
	at org.testcontainers.containers.KafkaContainer.doStart(KafkaContainer.java:97)
	at org.testcontainers.containers.GenericContainer.start(GenericContainer.java:312)
	at reactor.kafka.AbstractKafkaTest.setUpAbstractKafkaTest(AbstractKafkaTest.java:92)
	at sun.reflect.GeneratedMethodAccessor3.invoke(Unknown Source)
	at sun.reflect.DelegatingMethodAccessorImpl.invoke(DelegatingMethodAccessorImpl.java:43)
(81 more lines...)
Collapse Failed KafkaReceiverTest manualCommitSyncNoPoll History
< 1 sec
org.testcontainers.containers.ContainerLaunchException: org.testcontainers.containers.ContainerLaunchException: Container startup failed
org.testcontainers.containers.ContainerLaunchException: Container startup failed
	at org.testcontainers.containers.GenericContainer.doStart(GenericContainer.java:331)
	at org.testcontainers.containers.KafkaContainer.doStart(KafkaContainer.java:97)
	at org.testcontainers.containers.GenericContainer.start(GenericContainer.java:312)
	at reactor.kafka.AbstractKafkaTest.setUpAbstractKafkaTest(AbstractKafkaTest.java:92)
	at sun.reflect.GeneratedMethodAccessor3.invoke(Unknown Source)
	at sun.reflect.DelegatingMethodAccessorImpl.invoke(DelegatingMethodAccessorImpl.java:43)
(81 more lines...)
Collapse Failed KafkaReceiverTest messageProcessingDelay History
< 1 sec
org.testcontainers.containers.ContainerLaunchException: org.testcontainers.containers.ContainerLaunchException: Container startup failed
org.testcontainers.containers.ContainerLaunchException: Container startup failed
	at org.testcontainers.containers.GenericContainer.doStart(GenericContainer.java:331)
	at org.testcontainers.containers.KafkaContainer.doStart(KafkaContainer.java:97)
	at org.testcontainers.containers.GenericContainer.start(GenericContainer.java:312)
	at reactor.kafka.AbstractKafkaTest.setUpAbstractKafkaTest(AbstractKafkaTest.java:92)
	at sun.reflect.GeneratedMethodAccessor3.invoke(Unknown Source)
	at sun.reflect.DelegatingMethodAccessorImpl.invoke(DelegatingMethodAccessorImpl.java:43)
(81 more lines...)
Collapse Failed KafkaReceiverTest messageProcessorFailure History
< 1 sec
org.testcontainers.containers.ContainerLaunchException: org.testcontainers.containers.ContainerLaunchException: Container startup failed
org.testcontainers.containers.ContainerLaunchException: Container startup failed
	at org.testcontainers.containers.GenericContainer.doStart(GenericContainer.java:331)
	at org.testcontainers.containers.KafkaContainer.doStart(KafkaContainer.java:97)
	at org.testcontainers.containers.GenericContainer.start(GenericContainer.java:312)
	at reactor.kafka.AbstractKafkaTest.setUpAbstractKafkaTest(AbstractKafkaTest.java:92)
	at sun.reflect.GeneratedMethodAccessor3.invoke(Unknown Source)
	at sun.reflect.DelegatingMethodAccessorImpl.invoke(DelegatingMethodAccessorImpl.java:43)
(81 more lines...)
Collapse Failed KafkaReceiverTest multiConsumerGroup History
< 1 sec
org.testcontainers.containers.ContainerLaunchException: org.testcontainers.containers.ContainerLaunchException: Container startup failed
org.testcontainers.containers.ContainerLaunchException: Container startup failed
	at org.testcontainers.containers.GenericContainer.doStart(GenericContainer.java:331)
	at org.testcontainers.containers.KafkaContainer.doStart(KafkaContainer.java:97)
	at org.testcontainers.containers.GenericContainer.start(GenericContainer.java:312)
	at reactor.kafka.AbstractKafkaTest.setUpAbstractKafkaTest(AbstractKafkaTest.java:92)
	at sun.reflect.GeneratedMethodAccessor3.invoke(Unknown Source)
	at sun.reflect.DelegatingMethodAccessorImpl.invoke(DelegatingMethodAccessorImpl.java:43)
(81 more lines...)
Collapse Failed KafkaReceiverTest offsetResetLatest History
< 1 sec
org.testcontainers.containers.ContainerLaunchException: org.testcontainers.containers.ContainerLaunchException: Container startup failed
org.testcontainers.containers.ContainerLaunchException: Container startup failed
	at org.testcontainers.containers.GenericContainer.doStart(GenericContainer.java:331)
	at org.testcontainers.containers.KafkaContainer.doStart(KafkaContainer.java:97)
	at org.testcontainers.containers.GenericContainer.start(GenericContainer.java:312)
	at reactor.kafka.AbstractKafkaTest.setUpAbstractKafkaTest(AbstractKafkaTest.java:92)
	at sun.reflect.GeneratedMethodAccessor3.invoke(Unknown Source)
	at sun.reflect.DelegatingMethodAccessorImpl.invoke(DelegatingMethodAccessorImpl.java:43)
(81 more lines...)
Collapse Failed KafkaReceiverTest publishFromCustomScheduler History
< 1 sec
org.testcontainers.containers.ContainerLaunchException: org.testcontainers.containers.ContainerLaunchException: Container startup failed
org.testcontainers.containers.ContainerLaunchException: Container startup failed
	at org.testcontainers.containers.GenericContainer.doStart(GenericContainer.java:331)
	at org.testcontainers.containers.KafkaContainer.doStart(KafkaContainer.java:97)
	at org.testcontainers.containers.GenericContainer.start(GenericContainer.java:312)
	at reactor.kafka.AbstractKafkaTest.setUpAbstractKafkaTest(AbstractKafkaTest.java:92)
	at sun.reflect.GeneratedMethodAccessor3.invoke(Unknown Source)
	at sun.reflect.DelegatingMethodAccessorImpl.invoke(DelegatingMethodAccessorImpl.java:43)
(81 more lines...)
Collapse Failed KafkaReceiverTest publishFromEventScheduler History
< 1 sec
org.testcontainers.containers.ContainerLaunchException: org.testcontainers.containers.ContainerLaunchException: Container startup failed
org.testcontainers.containers.ContainerLaunchException: Container startup failed
	at org.testcontainers.containers.GenericContainer.doStart(GenericContainer.java:331)
	at org.testcontainers.containers.KafkaContainer.doStart(KafkaContainer.java:97)
	at org.testcontainers.containers.GenericContainer.start(GenericContainer.java:312)
	at reactor.kafka.AbstractKafkaTest.setUpAbstractKafkaTest(AbstractKafkaTest.java:92)
	at sun.reflect.GeneratedMethodAccessor3.invoke(Unknown Source)
	at sun.reflect.DelegatingMethodAccessorImpl.invoke(DelegatingMethodAccessorImpl.java:43)
(81 more lines...)
Collapse Failed KafkaReceiverTest resumeAfterFailure History
< 1 sec
org.testcontainers.containers.ContainerLaunchException: org.testcontainers.containers.ContainerLaunchException: Container startup failed
org.testcontainers.containers.ContainerLaunchException: Container startup failed
	at org.testcontainers.containers.GenericContainer.doStart(GenericContainer.java:331)
	at org.testcontainers.containers.KafkaContainer.doStart(KafkaContainer.java:97)
	at org.testcontainers.containers.GenericContainer.start(GenericContainer.java:312)
	at reactor.kafka.AbstractKafkaTest.setUpAbstractKafkaTest(AbstractKafkaTest.java:92)
	at sun.reflect.GeneratedMethodAccessor3.invoke(Unknown Source)
	at sun.reflect.DelegatingMethodAccessorImpl.invoke(DelegatingMethodAccessorImpl.java:43)
(81 more lines...)
Collapse Failed KafkaReceiverTest seekToBeginning History
< 1 sec
org.testcontainers.containers.ContainerLaunchException: org.testcontainers.containers.ContainerLaunchException: Container startup failed
org.testcontainers.containers.ContainerLaunchException: Container startup failed
	at org.testcontainers.containers.GenericContainer.doStart(GenericContainer.java:331)
	at org.testcontainers.containers.KafkaContainer.doStart(KafkaContainer.java:97)
	at org.testcontainers.containers.GenericContainer.start(GenericContainer.java:312)
	at reactor.kafka.AbstractKafkaTest.setUpAbstractKafkaTest(AbstractKafkaTest.java:92)
	at sun.reflect.GeneratedMethodAccessor3.invoke(Unknown Source)
	at sun.reflect.DelegatingMethodAccessorImpl.invoke(DelegatingMethodAccessorImpl.java:43)
(81 more lines...)
Collapse Failed KafkaReceiverTest seekToEnd History
< 1 sec
org.testcontainers.containers.ContainerLaunchException: org.testcontainers.containers.ContainerLaunchException: Container startup failed
org.testcontainers.containers.ContainerLaunchException: Container startup failed
	at org.testcontainers.containers.GenericContainer.doStart(GenericContainer.java:331)
	at org.testcontainers.containers.KafkaContainer.doStart(KafkaContainer.java:97)
	at org.testcontainers.containers.GenericContainer.start(GenericContainer.java:312)
	at reactor.kafka.AbstractKafkaTest.setUpAbstractKafkaTest(AbstractKafkaTest.java:92)
	at sun.reflect.GeneratedMethodAccessor3.invoke(Unknown Source)
	at sun.reflect.DelegatingMethodAccessorImpl.invoke(DelegatingMethodAccessorImpl.java:43)
(81 more lines...)
Collapse Failed KafkaReceiverTest seekToOffset History
< 1 sec
org.testcontainers.containers.ContainerLaunchException: org.testcontainers.containers.ContainerLaunchException: Container startup failed
org.testcontainers.containers.ContainerLaunchException: Container startup failed
	at org.testcontainers.containers.GenericContainer.doStart(GenericContainer.java:331)
	at org.testcontainers.containers.KafkaContainer.doStart(KafkaContainer.java:97)
	at org.testcontainers.containers.GenericContainer.start(GenericContainer.java:312)
	at reactor.kafka.AbstractKafkaTest.setUpAbstractKafkaTest(AbstractKafkaTest.java:92)
	at sun.reflect.GeneratedMethodAccessor3.invoke(Unknown Source)
	at sun.reflect.DelegatingMethodAccessorImpl.invoke(DelegatingMethodAccessorImpl.java:43)
(81 more lines...)
Collapse Failed KafkaReceiverTest sendNonTransactionalReadCommitted History
< 1 sec
org.testcontainers.containers.ContainerLaunchException: org.testcontainers.containers.ContainerLaunchException: Container startup failed
org.testcontainers.containers.ContainerLaunchException: Container startup failed
	at org.testcontainers.containers.GenericContainer.doStart(GenericContainer.java:331)
	at org.testcontainers.containers.KafkaContainer.doStart(KafkaContainer.java:97)
	at org.testcontainers.containers.GenericContainer.start(GenericContainer.java:312)
	at reactor.kafka.AbstractKafkaTest.setUpAbstractKafkaTest(AbstractKafkaTest.java:92)
	at sun.reflect.GeneratedMethodAccessor3.invoke(Unknown Source)
	at sun.reflect.DelegatingMethodAccessorImpl.invoke(DelegatingMethodAccessorImpl.java:43)
(81 more lines...)
Collapse Failed KafkaReceiverTest sendReceive History
< 1 sec
org.testcontainers.containers.ContainerLaunchException: org.testcontainers.containers.ContainerLaunchException: Container startup failed
org.testcontainers.containers.ContainerLaunchException: Container startup failed
	at org.testcontainers.containers.GenericContainer.doStart(GenericContainer.java:331)
	at org.testcontainers.containers.KafkaContainer.doStart(KafkaContainer.java:97)
	at org.testcontainers.containers.GenericContainer.start(GenericContainer.java:312)
	at reactor.kafka.AbstractKafkaTest.setUpAbstractKafkaTest(AbstractKafkaTest.java:92)
	at sun.reflect.GeneratedMethodAccessor3.invoke(Unknown Source)
	at sun.reflect.DelegatingMethodAccessorImpl.invoke(DelegatingMethodAccessorImpl.java:43)
(81 more lines...)
Collapse Failed KafkaReceiverTest sendReceiveWithHeaders History
< 1 sec
org.testcontainers.containers.ContainerLaunchException: org.testcontainers.containers.ContainerLaunchException: Container startup failed
org.testcontainers.containers.ContainerLaunchException: Container startup failed
	at org.testcontainers.containers.GenericContainer.doStart(GenericContainer.java:331)
	at org.testcontainers.containers.KafkaContainer.doStart(KafkaContainer.java:97)
	at org.testcontainers.containers.GenericContainer.start(GenericContainer.java:312)
	at reactor.kafka.AbstractKafkaTest.setUpAbstractKafkaTest(AbstractKafkaTest.java:92)
	at sun.reflect.GeneratedMethodAccessor3.invoke(Unknown Source)
	at sun.reflect.DelegatingMethodAccessorImpl.invoke(DelegatingMethodAccessorImpl.java:43)
(81 more lines...)
Collapse Failed KafkaReceiverTest sendTransactionalReadCommitted History
< 1 sec
org.testcontainers.containers.ContainerLaunchException: org.testcontainers.containers.ContainerLaunchException: Container startup failed
org.testcontainers.containers.ContainerLaunchException: Container startup failed
	at org.testcontainers.containers.GenericContainer.doStart(GenericContainer.java:331)
	at org.testcontainers.containers.KafkaContainer.doStart(KafkaContainer.java:97)
	at org.testcontainers.containers.GenericContainer.start(GenericContainer.java:312)
	at reactor.kafka.AbstractKafkaTest.setUpAbstractKafkaTest(AbstractKafkaTest.java:92)
	at sun.reflect.GeneratedMethodAccessor3.invoke(Unknown Source)
	at sun.reflect.DelegatingMethodAccessorImpl.invoke(DelegatingMethodAccessorImpl.java:43)
(81 more lines...)
Collapse Failed KafkaReceiverTest sendTransactionalReadUncommitted History
< 1 sec
org.testcontainers.containers.ContainerLaunchException: org.testcontainers.containers.ContainerLaunchException: Container startup failed
org.testcontainers.containers.ContainerLaunchException: Container startup failed
	at org.testcontainers.containers.GenericContainer.doStart(GenericContainer.java:331)
	at org.testcontainers.containers.KafkaContainer.doStart(KafkaContainer.java:97)
	at org.testcontainers.containers.GenericContainer.start(GenericContainer.java:312)
	at reactor.kafka.AbstractKafkaTest.setUpAbstractKafkaTest(AbstractKafkaTest.java:92)
	at sun.reflect.GeneratedMethodAccessor3.invoke(Unknown Source)
	at sun.reflect.DelegatingMethodAccessorImpl.invoke(DelegatingMethodAccessorImpl.java:43)
(81 more lines...)
Collapse Failed KafkaReceiverTest transactionalOffsetCommit History
< 1 sec
org.testcontainers.containers.ContainerLaunchException: org.testcontainers.containers.ContainerLaunchException: Container startup failed
org.testcontainers.containers.ContainerLaunchException: Container startup failed
	at org.testcontainers.containers.GenericContainer.doStart(GenericContainer.java:331)
	at org.testcontainers.containers.KafkaContainer.doStart(KafkaContainer.java:97)
	at org.testcontainers.containers.GenericContainer.start(GenericContainer.java:312)
	at reactor.kafka.AbstractKafkaTest.setUpAbstractKafkaTest(AbstractKafkaTest.java:92)
	at sun.reflect.GeneratedMethodAccessor3.invoke(Unknown Source)
	at sun.reflect.DelegatingMethodAccessorImpl.invoke(DelegatingMethodAccessorImpl.java:43)
(81 more lines...)
Collapse Failed KafkaReceiverTest transferMessages History
< 1 sec
org.testcontainers.containers.ContainerLaunchException: org.testcontainers.containers.ContainerLaunchException: Container startup failed
org.testcontainers.containers.ContainerLaunchException: Container startup failed
	at org.testcontainers.containers.GenericContainer.doStart(GenericContainer.java:331)
	at org.testcontainers.containers.KafkaContainer.doStart(KafkaContainer.java:97)
	at org.testcontainers.containers.GenericContainer.start(GenericContainer.java:312)
	at reactor.kafka.AbstractKafkaTest.setUpAbstractKafkaTest(AbstractKafkaTest.java:92)
	at sun.reflect.GeneratedMethodAccessor3.invoke(Unknown Source)
	at sun.reflect.DelegatingMethodAccessorImpl.invoke(DelegatingMethodAccessorImpl.java:43)
(81 more lines...)
Collapse Failed KafkaReceiverTest wildcardSubscribe History
< 1 sec
org.testcontainers.containers.ContainerLaunchException: org.testcontainers.containers.ContainerLaunchException: Container startup failed
org.testcontainers.containers.ContainerLaunchException: Container startup failed
	at org.testcontainers.containers.GenericContainer.doStart(GenericContainer.java:331)
	at org.testcontainers.containers.KafkaContainer.doStart(KafkaContainer.java:97)
	at org.testcontainers.containers.GenericContainer.start(GenericContainer.java:312)
	at reactor.kafka.AbstractKafkaTest.setUpAbstractKafkaTest(AbstractKafkaTest.java:92)
	at sun.reflect.GeneratedMethodAccessor3.invoke(Unknown Source)
	at sun.reflect.DelegatingMethodAccessorImpl.invoke(DelegatingMethodAccessorImpl.java:43)
(81 more lines...)
Collapse Failed KafkaSenderTest concurrentSends History
< 1 sec
org.testcontainers.containers.ContainerLaunchException: org.testcontainers.containers.ContainerLaunchException: Container startup failed
org.testcontainers.containers.ContainerLaunchException: Container startup failed
	at org.testcontainers.containers.GenericContainer.doStart(GenericContainer.java:331)
	at org.testcontainers.containers.KafkaContainer.doStart(KafkaContainer.java:97)
	at org.testcontainers.containers.GenericContainer.start(GenericContainer.java:312)
	at reactor.kafka.AbstractKafkaTest.setUpAbstractKafkaTest(AbstractKafkaTest.java:92)
	at sun.reflect.NativeMethodAccessorImpl.invoke0(Native Method)
	at sun.reflect.NativeMethodAccessorImpl.invoke(NativeMethodAccessorImpl.java:62)
(75 more lines...)
Collapse Failed KafkaSenderTest fireAndForget History
< 1 sec
org.testcontainers.containers.ContainerLaunchException: org.testcontainers.containers.ContainerLaunchException: Container startup failed
org.testcontainers.containers.ContainerLaunchException: Container startup failed
	at org.testcontainers.containers.GenericContainer.doStart(GenericContainer.java:331)
	at org.testcontainers.containers.KafkaContainer.doStart(KafkaContainer.java:97)
	at org.testcontainers.containers.GenericContainer.start(GenericContainer.java:312)
	at reactor.kafka.AbstractKafkaTest.setUpAbstractKafkaTest(AbstractKafkaTest.java:92)
	at sun.reflect.GeneratedMethodAccessor3.invoke(Unknown Source)
	at sun.reflect.DelegatingMethodAccessorImpl.invoke(DelegatingMethodAccessorImpl.java:43)
(81 more lines...)
Collapse Failed KafkaSenderTest maxInFlight History
< 1 sec
org.testcontainers.containers.ContainerLaunchException: org.testcontainers.containers.ContainerLaunchException: Container startup failed
org.testcontainers.containers.ContainerLaunchException: Container startup failed
	at org.testcontainers.containers.GenericContainer.doStart(GenericContainer.java:331)
	at org.testcontainers.containers.KafkaContainer.doStart(KafkaContainer.java:97)
	at org.testcontainers.containers.GenericContainer.start(GenericContainer.java:312)
	at reactor.kafka.AbstractKafkaTest.setUpAbstractKafkaTest(AbstractKafkaTest.java:92)
	at sun.reflect.NativeMethodAccessorImpl.invoke0(Native Method)
	at sun.reflect.NativeMethodAccessorImpl.invoke(NativeMethodAccessorImpl.java:62)
(75 more lines...)
Collapse Failed KafkaSenderTest sendChain History
< 1 sec
org.testcontainers.containers.ContainerLaunchException: org.testcontainers.containers.ContainerLaunchException: Container startup failed
org.testcontainers.containers.ContainerLaunchException: Container startup failed
	at org.testcontainers.containers.GenericContainer.doStart(GenericContainer.java:331)
	at org.testcontainers.containers.KafkaContainer.doStart(KafkaContainer.java:97)
	at org.testcontainers.containers.GenericContainer.start(GenericContainer.java:312)
	at reactor.kafka.AbstractKafkaTest.setUpAbstractKafkaTest(AbstractKafkaTest.java:92)
	at sun.reflect.NativeMethodAccessorImpl.invoke0(Native Method)
	at sun.reflect.NativeMethodAccessorImpl.invoke(NativeMethodAccessorImpl.java:62)
(75 more lines...)
Collapse Failed KafkaSenderTest sendDontStopOnSerializationError History
< 1 sec
org.testcontainers.containers.ContainerLaunchException: org.testcontainers.containers.ContainerLaunchException: Container startup failed
org.testcontainers.containers.ContainerLaunchException: Container startup failed
	at org.testcontainers.containers.GenericContainer.doStart(GenericContainer.java:331)
	at org.testcontainers.containers.KafkaContainer.doStart(KafkaContainer.java:97)
	at org.testcontainers.containers.GenericContainer.start(GenericContainer.java:312)
	at reactor.kafka.AbstractKafkaTest.setUpAbstractKafkaTest(AbstractKafkaTest.java:92)
	at sun.reflect.NativeMethodAccessorImpl.invoke0(Native Method)
	at sun.reflect.NativeMethodAccessorImpl.invoke(NativeMethodAccessorImpl.java:62)
(75 more lines...)
Collapse Failed KafkaSenderTest sendNoResponse History
< 1 sec
org.testcontainers.containers.ContainerLaunchException: org.testcontainers.containers.ContainerLaunchException: Container startup failed
org.testcontainers.containers.ContainerLaunchException: Container startup failed
	at org.testcontainers.containers.GenericContainer.doStart(GenericContainer.java:331)
	at org.testcontainers.containers.KafkaContainer.doStart(KafkaContainer.java:97)
	at org.testcontainers.containers.GenericContainer.start(GenericContainer.java:312)
	at reactor.kafka.AbstractKafkaTest.setUpAbstractKafkaTest(AbstractKafkaTest.java:92)
	at sun.reflect.NativeMethodAccessorImpl.invoke0(Native Method)
	at sun.reflect.NativeMethodAccessorImpl.invoke(NativeMethodAccessorImpl.java:62)
(75 more lines...)
Collapse Failed KafkaSenderTest sendResponseBlock History
< 1 sec
org.testcontainers.containers.ContainerLaunchException: org.testcontainers.containers.ContainerLaunchException: Container startup failed
org.testcontainers.containers.ContainerLaunchException: Container startup failed
	at org.testcontainers.containers.GenericContainer.doStart(GenericContainer.java:331)
	at org.testcontainers.containers.KafkaContainer.doStart(KafkaContainer.java:97)
	at org.testcontainers.containers.GenericContainer.start(GenericContainer.java:312)
	at reactor.kafka.AbstractKafkaTest.setUpAbstractKafkaTest(AbstractKafkaTest.java:92)
	at sun.reflect.NativeMethodAccessorImpl.invoke0(Native Method)
	at sun.reflect.NativeMethodAccessorImpl.invoke(NativeMethodAccessorImpl.java:62)
(75 more lines...)
Collapse Failed KafkaSenderTest sendResponseCorrelator History
< 1 sec
org.testcontainers.containers.ContainerLaunchException: org.testcontainers.containers.ContainerLaunchException: Container startup failed
org.testcontainers.containers.ContainerLaunchException: Container startup failed
	at org.testcontainers.containers.GenericContainer.doStart(GenericContainer.java:331)
	at org.testcontainers.containers.KafkaContainer.doStart(KafkaContainer.java:97)
	at org.testcontainers.containers.GenericContainer.start(GenericContainer.java:312)
	at reactor.kafka.AbstractKafkaTest.setUpAbstractKafkaTest(AbstractKafkaTest.java:92)
	at sun.reflect.NativeMethodAccessorImpl.invoke0(Native Method)
	at sun.reflect.NativeMethodAccessorImpl.invoke(NativeMethodAccessorImpl.java:62)
(75 more lines...)
Collapse Failed KafkaSenderTest sendResponseEmitter History
< 1 sec
org.testcontainers.containers.ContainerLaunchException: org.testcontainers.containers.ContainerLaunchException: Container startup failed
org.testcontainers.containers.ContainerLaunchException: Container startup failed
	at org.testcontainers.containers.GenericContainer.doStart(GenericContainer.java:331)
	at org.testcontainers.containers.KafkaContainer.doStart(KafkaContainer.java:97)
	at org.testcontainers.containers.GenericContainer.start(GenericContainer.java:312)
	at reactor.kafka.AbstractKafkaTest.setUpAbstractKafkaTest(AbstractKafkaTest.java:92)
	at sun.reflect.NativeMethodAccessorImpl.invoke0(Native Method)
	at sun.reflect.NativeMethodAccessorImpl.invoke(NativeMethodAccessorImpl.java:62)
(75 more lines...)
Existing test failures 8
Status Test Failing since Duration
org.testcontainers.containers.ContainerLaunchException: org.testcontainers.containers.ContainerLaunchException: Container startup failed
org.testcontainers.containers.ContainerLaunchException: Container startup failed
	at org.testcontainers.containers.GenericContainer.doStart(GenericContainer.java:331)
	at org.testcontainers.containers.KafkaContainer.doStart(KafkaContainer.java:97)
	at org.testcontainers.containers.GenericContainer.start(GenericContainer.java:312)
	at reactor.kafka.AbstractKafkaTest.setUpAbstractKafkaTest(AbstractKafkaTest.java:92)
	at sun.reflect.GeneratedMethodAccessor3.invoke(Unknown Source)
	at sun.reflect.DelegatingMethodAccessorImpl.invoke(DelegatingMethodAccessorImpl.java:43)
(81 more lines...)
org.testcontainers.containers.ContainerLaunchException: org.testcontainers.containers.ContainerLaunchException: Container startup failed
org.testcontainers.containers.ContainerLaunchException: Container startup failed
	at org.testcontainers.containers.GenericContainer.doStart(GenericContainer.java:331)
	at org.testcontainers.containers.KafkaContainer.doStart(KafkaContainer.java:97)
	at org.testcontainers.containers.GenericContainer.start(GenericContainer.java:312)
	at reactor.kafka.AbstractKafkaTest.setUpAbstractKafkaTest(AbstractKafkaTest.java:92)
	at sun.reflect.GeneratedMethodAccessor3.invoke(Unknown Source)
	at sun.reflect.DelegatingMethodAccessorImpl.invoke(DelegatingMethodAccessorImpl.java:43)
(81 more lines...)
org.testcontainers.containers.ContainerLaunchException: org.testcontainers.containers.ContainerLaunchException: Container startup failed
org.testcontainers.containers.ContainerLaunchException: Container startup failed
	at org.testcontainers.containers.GenericContainer.doStart(GenericContainer.java:331)
	at org.testcontainers.containers.KafkaContainer.doStart(KafkaContainer.java:97)
	at org.testcontainers.containers.GenericContainer.start(GenericContainer.java:312)
	at reactor.kafka.AbstractKafkaTest.setUpAbstractKafkaTest(AbstractKafkaTest.java:92)
	at sun.reflect.NativeMethodAccessorImpl.invoke0(Native Method)
	at sun.reflect.NativeMethodAccessorImpl.invoke(NativeMethodAccessorImpl.java:62)
(75 more lines...)
org.testcontainers.containers.ContainerLaunchException: org.testcontainers.containers.ContainerLaunchException: Container startup failed
org.testcontainers.containers.ContainerLaunchException: Container startup failed
	at org.testcontainers.containers.GenericContainer.doStart(GenericContainer.java:331)
	at org.testcontainers.containers.KafkaContainer.doStart(KafkaContainer.java:97)
	at org.testcontainers.containers.GenericContainer.start(GenericContainer.java:312)
	at reactor.kafka.AbstractKafkaTest.setUpAbstractKafkaTest(AbstractKafkaTest.java:92)
	at sun.reflect.NativeMethodAccessorImpl.invoke0(Native Method)
	at sun.reflect.NativeMethodAccessorImpl.invoke(NativeMethodAccessorImpl.java:62)
(75 more lines...)
org.testcontainers.containers.ContainerLaunchException: org.testcontainers.containers.ContainerLaunchException: Container startup failed
org.testcontainers.containers.ContainerLaunchException: Container startup failed
	at org.testcontainers.containers.GenericContainer.doStart(GenericContainer.java:331)
	at org.testcontainers.containers.KafkaContainer.doStart(KafkaContainer.java:97)
	at org.testcontainers.containers.GenericContainer.start(GenericContainer.java:312)
	at reactor.kafka.AbstractKafkaTest.setUpAbstractKafkaTest(AbstractKafkaTest.java:92)
	at sun.reflect.NativeMethodAccessorImpl.invoke0(Native Method)
	at sun.reflect.NativeMethodAccessorImpl.invoke(NativeMethodAccessorImpl.java:62)
(75 more lines...)
org.testcontainers.containers.ContainerLaunchException: org.testcontainers.containers.ContainerLaunchException: Container startup failed
org.testcontainers.containers.ContainerLaunchException: Container startup failed
	at org.testcontainers.containers.GenericContainer.doStart(GenericContainer.java:331)
	at org.testcontainers.containers.KafkaContainer.doStart(KafkaContainer.java:97)
	at org.testcontainers.containers.GenericContainer.start(GenericContainer.java:312)
	at reactor.kafka.AbstractKafkaTest.setUpAbstractKafkaTest(AbstractKafkaTest.java:92)
	at sun.reflect.NativeMethodAccessorImpl.invoke0(Native Method)
	at sun.reflect.NativeMethodAccessorImpl.invoke(NativeMethodAccessorImpl.java:62)
(75 more lines...)
org.testcontainers.containers.ContainerLaunchException: org.testcontainers.containers.ContainerLaunchException: Container startup failed
org.testcontainers.containers.ContainerLaunchException: Container startup failed
	at org.testcontainers.containers.GenericContainer.doStart(GenericContainer.java:331)
	at org.testcontainers.containers.KafkaContainer.doStart(KafkaContainer.java:97)
	at org.testcontainers.containers.GenericContainer.start(GenericContainer.java:312)
	at reactor.kafka.AbstractKafkaTest.setUpAbstractKafkaTest(AbstractKafkaTest.java:92)
	at sun.reflect.NativeMethodAccessorImpl.invoke0(Native Method)
	at sun.reflect.NativeMethodAccessorImpl.invoke(NativeMethodAccessorImpl.java:62)
(75 more lines...)
org.testcontainers.containers.ContainerLaunchException: org.testcontainers.containers.ContainerLaunchException: Container startup failed
org.testcontainers.containers.ContainerLaunchException: Container startup failed
	at org.testcontainers.containers.GenericContainer.doStart(GenericContainer.java:331)
	at org.testcontainers.containers.KafkaContainer.doStart(KafkaContainer.java:97)
	at org.testcontainers.containers.GenericContainer.start(GenericContainer.java:312)
	at reactor.kafka.AbstractKafkaTest.setUpAbstractKafkaTest(AbstractKafkaTest.java:92)
	at sun.reflect.NativeMethodAccessorImpl.invoke0(Native Method)
	at sun.reflect.NativeMethodAccessorImpl.invoke(NativeMethodAccessorImpl.java:62)
(75 more lines...)

Error summary

The build generated some errors. See the full build log for more details.

        at org.gradle.tooling.internal.provider.GradleThreadBuildActionExecuter.execute(GradleThreadBuildActionExecuter.java:26)
        at org.gradle.tooling.internal.provider.ParallelismConfigurationBuildActionExecuter.execute(ParallelismConfigurationBuildActionExecuter.java:43)
        at org.gradle.tooling.internal.provider.ParallelismConfigurationBuildActionExecuter.execute(ParallelismConfigurationBuildActionExecuter.java:29)
        at org.gradle.tooling.internal.provider.StartParamsValidatingActionExecuter.execute(StartParamsValidatingActionExecuter.java:60)
        at org.gradle.tooling.internal.provider.StartParamsValidatingActionExecuter.execute(StartParamsValidatingActionExecuter.java:32)
        at org.gradle.tooling.internal.provider.SessionFailureReportingActionExecuter.execute(SessionFailureReportingActionExecuter.java:55)
        at org.gradle.tooling.internal.provider.SessionFailureReportingActionExecuter.execute(SessionFailureReportingActionExecuter.java:41)
        at org.gradle.tooling.internal.provider.SetupLoggingActionExecuter.execute(SetupLoggingActionExecuter.java:48)
        at org.gradle.tooling.internal.provider.SetupLoggingActionExecuter.execute(SetupLoggingActionExecuter.java:32)
        at org.gradle.launcher.daemon.server.exec.ExecuteBuild.doBuild(ExecuteBuild.java:68)
        at org.gradle.launcher.daemon.server.exec.BuildCommandOnly.execute(BuildCommandOnly.java:37)
        at org.gradle.launcher.daemon.server.api.DaemonCommandExecution.proceed(DaemonCommandExecution.java:104)
        at org.gradle.launcher.daemon.server.exec.WatchForDisconnection.execute(WatchForDisconnection.java:39)
        at org.gradle.launcher.daemon.server.api.DaemonCommandExecution.proceed(DaemonCommandExecution.java:104)
        at org.gradle.launcher.daemon.server.exec.ResetDeprecationLogger.execute(ResetDeprecationLogger.java:27)
        at org.gradle.launcher.daemon.server.api.DaemonCommandExecution.proceed(DaemonCommandExecution.java:104)
        at org.gradle.launcher.daemon.server.exec.RequestStopIfSingleUsedDaemon.execute(RequestStopIfSingleUsedDaemon.java:35)
        at org.gradle.launcher.daemon.server.api.DaemonCommandExecution.proceed(DaemonCommandExecution.java:104)
        at org.gradle.launcher.daemon.server.exec.ForwardClientInput$2.create(ForwardClientInput.java:78)
        at org.gradle.launcher.daemon.server.exec.ForwardClientInput$2.create(ForwardClientInput.java:75)
        at org.gradle.util.Swapper.swap(Swapper.java:38)
        at org.gradle.launcher.daemon.server.exec.ForwardClientInput.execute(ForwardClientInput.java:75)
        at org.gradle.launcher.daemon.server.api.DaemonCommandExecution.proceed(DaemonCommandExecution.java:104)
        at org.gradle.launcher.daemon.server.exec.LogAndCheckHealth.execute(LogAndCheckHealth.java:55)
        at org.gradle.launcher.daemon.server.api.DaemonCommandExecution.proceed(DaemonCommandExecution.java:104)
        at org.gradle.launcher.daemon.server.exec.LogToClient.doBuild(LogToClient.java:63)
        at org.gradle.launcher.daemon.server.exec.BuildCommandOnly.execute(BuildCommandOnly.java:37)
        at org.gradle.launcher.daemon.server.api.DaemonCommandExecution.proceed(DaemonCommandExecution.java:104)
        at org.gradle.launcher.daemon.server.exec.EstablishBuildEnvironment.doBuild(EstablishBuildEnvironment.java:82)
        at org.gradle.launcher.daemon.server.exec.BuildCommandOnly.execute(BuildCommandOnly.java:37)
        at org.gradle.launcher.daemon.server.api.DaemonCommandExecution.proceed(DaemonCommandExecution.java:104)
        at org.gradle.launcher.daemon.server.exec.StartBuildOrRespondWithBusy$1.run(StartBuildOrRespondWithBusy.java:52)
        at org.gradle.launcher.daemon.server.DaemonStateCoordinator$1.run(DaemonStateCoordinator.java:297)
        at org.gradle.internal.concurrent.ExecutorPolicy$CatchAndRecordFailures.onExecute(ExecutorPolicy.java:64)
        at org.gradle.internal.concurrent.ManagedExecutorImpl$1.run(ManagedExecutorImpl.java:48)
        at org.gradle.internal.concurrent.ThreadFactoryImpl$ManagedThreadRunnable.run(ThreadFactoryImpl.java:56)
Caused by: org.gradle.api.GradleException: There were failing tests. See the report at: file:///opt/bamboo-home/xml-data/build-dir/REACTOR-RKAFKA-AERON/build/reports/tests/test/index.html
        at org.gradle.api.tasks.testing.AbstractTestTask.handleTestFailures(AbstractTestTask.java:632)
        at org.gradle.api.tasks.testing.AbstractTestTask.executeTests(AbstractTestTask.java:501)
        at org.gradle.api.tasks.testing.Test.executeTests(Test.java:613)
        at org.gradle.internal.reflect.JavaMethod.invoke(JavaMethod.java:103)
        at org.gradle.api.internal.project.taskfactory.StandardTaskAction.doExecute(StandardTaskAction.java:49)
        at org.gradle.api.internal.project.taskfactory.StandardTaskAction.execute(StandardTaskAction.java:42)
        at org.gradle.api.internal.project.taskfactory.StandardTaskAction.execute(StandardTaskAction.java:28)
        at org.gradle.api.internal.AbstractTask$TaskActionWrapper.execute(AbstractTask.java:717)
        at org.gradle.api.internal.AbstractTask$TaskActionWrapper.execute(AbstractTask.java:684)
        at org.gradle.api.internal.tasks.execution.ExecuteActionsTaskExecuter$5.run(ExecuteActionsTaskExecuter.java:476)
        at org.gradle.internal.operations.DefaultBuildOperationExecutor$RunnableBuildOperationWorker.execute(DefaultBuildOperationExecutor.java:402)
        at org.gradle.internal.operations.DefaultBuildOperationExecutor$RunnableBuildOperationWorker.execute(DefaultBuildOperationExecutor.java:394)
        at org.gradle.internal.operations.DefaultBuildOperationExecutor$1.execute(DefaultBuildOperationExecutor.java:165)
        at org.gradle.internal.operations.DefaultBuildOperationExecutor.execute(DefaultBuildOperationExecutor.java:250)
        at org.gradle.internal.operations.DefaultBuildOperationExecutor.execute(DefaultBuildOperationExecutor.java:158)
        at org.gradle.internal.operations.DefaultBuildOperationExecutor.run(DefaultBuildOperationExecutor.java:92)
        at org.gradle.internal.operations.DelegatingBuildOperationExecutor.run(DelegatingBuildOperationExecutor.java:31)
        at org.gradle.api.internal.tasks.execution.ExecuteActionsTaskExecuter.executeAction(ExecuteActionsTaskExecuter.java:461)
        at org.gradle.api.internal.tasks.execution.ExecuteActionsTaskExecuter.executeActions(ExecuteActionsTaskExecuter.java:444)
        at org.gradle.api.internal.tasks.execution.ExecuteActionsTaskExecuter.access$200(ExecuteActionsTaskExecuter.java:93)
        at org.gradle.api.internal.tasks.execution.ExecuteActionsTaskExecuter$TaskExecution.execute(ExecuteActionsTaskExecuter.java:237)
        at org.gradle.internal.execution.steps.ExecuteStep.lambda$execute$1(ExecuteStep.java:33)
        at org.gradle.internal.execution.steps.ExecuteStep.execute(ExecuteStep.java:33)
        at org.gradle.internal.execution.steps.ExecuteStep.execute(ExecuteStep.java:26)
        at org.gradle.internal.execution.steps.CleanupOutputsStep.execute(CleanupOutputsStep.java:58)
        at org.gradle.internal.execution.steps.CleanupOutputsStep.execute(CleanupOutputsStep.java:35)
        at org.gradle.internal.execution.steps.ResolveInputChangesStep.execute(ResolveInputChangesStep.java:48)
        at org.gradle.internal.execution.steps.ResolveInputChangesStep.execute(ResolveInputChangesStep.java:33)
        at org.gradle.internal.execution.steps.CancelExecutionStep.execute(CancelExecutionStep.java:39)
        at org.gradle.internal.execution.steps.TimeoutStep.executeWithoutTimeout(TimeoutStep.java:73)
        at org.gradle.internal.execution.steps.TimeoutStep.execute(TimeoutStep.java:54)
        at org.gradle.internal.execution.steps.CatchExceptionStep.execute(CatchExceptionStep.java:35)
        at org.gradle.internal.execution.steps.CreateOutputsStep.execute(CreateOutputsStep.java:51)
        at org.gradle.internal.execution.steps.SnapshotOutputsStep.execute(SnapshotOutputsStep.java:45)
        at org.gradle.internal.execution.steps.SnapshotOutputsStep.execute(SnapshotOutputsStep.java:31)
        at org.gradle.internal.execution.steps.CacheStep.executeWithoutCache(CacheStep.java:208)
        at org.gradle.internal.execution.steps.CacheStep.execute(CacheStep.java:70)
        at org.gradle.internal.execution.steps.CacheStep.execute(CacheStep.java:45)
        at org.gradle.internal.execution.steps.BroadcastChangingOutputsStep.execute(BroadcastChangingOutputsStep.java:49)
        at org.gradle.internal.execution.steps.StoreSnapshotsStep.execute(StoreSnapshotsStep.java:43)
        at org.gradle.internal.execution.steps.StoreSnapshotsStep.execute(StoreSnapshotsStep.java:32)
        at org.gradle.internal.execution.steps.RecordOutputsStep.execute(RecordOutputsStep.java:38)
        at org.gradle.internal.execution.steps.RecordOutputsStep.execute(RecordOutputsStep.java:24)
        at org.gradle.internal.execution.steps.SkipUpToDateStep.executeBecause(SkipUpToDateStep.java:96)
        at org.gradle.internal.execution.steps.SkipUpToDateStep.lambda$execute$0(SkipUpToDateStep.java:89)
        at org.gradle.internal.execution.steps.SkipUpToDateStep.execute(SkipUpToDateStep.java:54)
        at org.gradle.internal.execution.steps.SkipUpToDateStep.execute(SkipUpToDateStep.java:38)
        at org.gradle.internal.execution.steps.ResolveChangesStep.execute(ResolveChangesStep.java:76)
        at org.gradle.internal.execution.steps.ResolveChangesStep.execute(ResolveChangesStep.java:37)
        at org.gradle.internal.execution.steps.legacy.MarkSnapshottingInputsFinishedStep.execute(MarkSnapshottingInputsFinishedStep.java:36)
        at org.gradle.internal.execution.steps.legacy.MarkSnapshottingInputsFinishedStep.execute(MarkSnapshottingInputsFinishedStep.java:26)
        at org.gradle.internal.execution.steps.ResolveCachingStateStep.execute(ResolveCachingStateStep.java:90)
        at org.gradle.internal.execution.steps.ResolveCachingStateStep.execute(ResolveCachingStateStep.java:48)
        at org.gradle.internal.execution.steps.CaptureStateBeforeExecutionStep.execute(CaptureStateBeforeExecutionStep.java:69)
        at org.gradle.internal.execution.steps.CaptureStateBeforeExecutionStep.execute(CaptureStateBeforeExecutionStep.java:47)
        at org.gradle.internal.execution.impl.DefaultWorkExecutor.execute(DefaultWorkExecutor.java:33)
        at org.gradle.api.internal.tasks.execution.ExecuteActionsTaskExecuter.execute(ExecuteActionsTaskExecuter.java:140)
        ... 128 more


* Get more help at https://help.gradle.org

BUILD FAILED in 1m 11s