Build #927

Build: #927 failed

Job: Kafka failed

Stages & jobs

  1. Default Stage

Test results

  • 165 tests in total
  • 1 test failed
  • 1 failure is new
  • 8 tests were quarantined / skipped
  • 4 minutes taken in total.

Build 927 has the following 1 errors: 1 new failure(s) occurred since the previous build.

New test failures 1
Status Test Duration
Collapse Failed EndToEndLatencyTest performanceRegressionTest History
19 secs
java.util.concurrent.ExecutionException: java.util.concurrent.ExecutionException: java.lang.RuntimeException: poll() timed out before finding a result : timeout=10000
java.util.concurrent.ExecutionException: java.lang.RuntimeException: poll() timed out before finding a result : timeout=10000
	at java.util.concurrent.FutureTask.report(FutureTask.java:122)
	at java.util.concurrent.FutureTask.get(FutureTask.java:206)
	at reactor.kafka.util.TestUtils.execute(TestUtils.java:94)
	at reactor.kafka.tools.perf.EndToEndLatencyTest.performanceRegressionTest(EndToEndLatencyTest.java:48)
	at sun.reflect.NativeMethodAccessorImpl.invoke0(Native Method)
	at sun.reflect.NativeMethodAccessorImpl.invoke(NativeMethodAccessorImpl.java:62)
(55 more lines...)