Build #933

Build: #933 failed

Job: Kafka failed

Stages & jobs

  1. Default Stage

Test results

  • 152 tests in total
  • 1 test failed
  • 1 failure is new
  • 8 tests were quarantined / skipped
  • 3 minutes taken in total.

Build 933 has the following 1 errors: 1 new failure(s) occurred since the previous build.

New test failures 1
Status Test Duration
Collapse Failed KafkaReceiverTest userPause History
< 1 sec
java.lang.AssertionError: java.lang.AssertionError: 
Expected size:<0> but was:<4> in:
<[userPause_11814352829031958-3,
    userPause_11814352829031958-2,
    userPause_11814352829031958-1,
    userPause_11814352829031958-0]>
java.lang.AssertionError: 
Expected size:<0> but was:<4> in:
(56 more lines...)