Build: #796 failed Changes by Spring Buildmaster

Build result summary

Details

Completed
Duration
8 minutes
Labels
None
Agent
bamboo-07.af.pivotal.io
Revision
de05af757b7974b93f25f0591f60ed896c1dbba9 de05af757b7974b93f25f0591f60ed896c1dbba9
Total tests
148

Responsible

Code commits

Author Commit Message Commit date
Spring Buildmaster Spring Buildmaster de05af757b7974b93f25f0591f60ed896c1dbba9 de05af757b7974b93f25f0591f60ed896c1dbba9 [artifactory-release] Next development version 1.0.2.BUILD-SNAPSHOT
Spring Buildmaster Spring Buildmaster 612b9aca471f08980d039fcbee955b8bf1acf3b0 612b9aca471f08980d039fcbee955b8bf1acf3b0 [artifactory-release] Release version 1.0.1.RELEASE

Tests

New test failures 1
Status Test View job Duration
Collapse Failed KafkaReceiverTest autoAckPollWithIntervalWillNotFailOnOverflow History
Kafka 36 secs
java.lang.AssertionError: java.lang.AssertionError: 25 messages not received, received=75 : [[0, 4, 8, 12, 16, 20, 24, 28, 32, 36, 40, 44, 48, 52, 56, 60, 64, 68, 72, 76, 80, 84, 88, 92, 96], [], [2, 6, 10, 14, 18, 22, 26, 30, 34, 38, 42, 46, 50, 54, 58, 62, 66, 70, 74, 78, 82, 86, 90, 94, 98], [3, 7, 11, 15, 19, 23, 27, 31, 35, 39, 43, 47, 51, 55, 59, 63, 67, 71, 75, 79, 83, 87, 91, 95, 99]]
java.lang.AssertionError: 25 messages not received, received=75 : [[0, 4, 8, 12, 16, 20, 24, 28, 32, 36, 40, 44, 48, 52, 56, 60, 64, 68, 72, 76, 80, 84, 88, 92, 96], [], [2, 6, 10, 14, 18, 22, 26, 30, 34, 38, 42, 46, 50, 54, 58, 62, 66, 70, 74, 78, 82, 86, 90, 94, 98], [3, 7, 11, 15, 19, 23, 27, 31, 35, 39, 43, 47, 51, 55, 59, 63, 67, 71, 75, 79, 83, 87, 91, 95, 99]]
	at org.junit.Assert.fail(Assert.java:88)
	at reactor.kafka.receiver.KafkaReceiverTest.waitForMessages(KafkaReceiverTest.java:1120)
	at reactor.kafka.receiver.KafkaReceiverTest.autoAckPollWithIntervalWillNotFailOnOverflow(KafkaReceiverTest.java:325)
	at sun.reflect.NativeMethodAccessorImpl.invoke0(Native Method)
	at sun.reflect.NativeMethodAccessorImpl.invoke(NativeMethodAccessorImpl.java:62)
	at sun.reflect.DelegatingMethodAccessorImpl.invoke(DelegatingMethodAccessorImpl.java:43)
(49 more lines...)