Build #1,316

Build result summary

Details

Completed
Duration
2 minutes
Labels
None
Agent
bamboo-03.af.pivotal.io
Revision
7d27685c05861ac3c6645b339c0250c8c85503cd 7d27685c05861ac3c6645b339c0250c8c85503cd
Total tests
285
Fixed in
#1317 (Changes by Stephane Maldini <smaldini@pivotal.io>)

Responsible

No one has taken responsibility for this failure

Code commits

Author Commit Message Commit date
Stephane Maldini <smaldini@pivotal.io> Stephane Maldini <smaldini@pivotal.io> 7d27685c05861ac3c6645b339c0250c8c85503cd 7d27685c05861ac3c6645b339c0250c8c85503cd Minor tweaks - prepare h2 (even if not enabled for now

Tests

New test failures 3
Status Test View job Duration
Collapse Failed HttpResourcesTest disposeLaterDefers History
Netty < 1 sec
reactor.core.Exceptions$ErrorCallbackNotImplemented: reactor.core.Exceptions$ErrorCallbackNotImplemented: org.junit.ComparisonFailure: expected:<[tru]e> but was:<[fals]e>
reactor.core.Exceptions$ErrorCallbackNotImplemented: org.junit.ComparisonFailure: expected:<[tru]e> but was:<[fals]e>
Caused by: org.junit.ComparisonFailure: expected:<[tru]e> but was:<[fals]e>
	at sun.reflect.NativeConstructorAccessorImpl.newInstance0(Native Method)
	at sun.reflect.NativeConstructorAccessorImpl.newInstance(NativeConstructorAccessorImpl.java:62)
	at sun.reflect.DelegatingConstructorAccessorImpl.newInstance(DelegatingConstructorAccessorImpl.java:45)
	at reactor.netty.http.HttpResourcesTest.lambda$disposeLaterDefers$0(HttpResourcesTest.java:89)
	at reactor.core.publisher.MonoPeekTerminal$MonoTerminalPeekSubscriber.onComplete(MonoPeekTerminal.java:311)
(53 more lines...)
Collapse Failed TcpResourcesTest disposeLaterDefers History
Netty < 1 sec
reactor.core.Exceptions$ErrorCallbackNotImplemented: reactor.core.Exceptions$ErrorCallbackNotImplemented: org.junit.ComparisonFailure: expected:<[tru]e> but was:<[fals]e>
reactor.core.Exceptions$ErrorCallbackNotImplemented: org.junit.ComparisonFailure: expected:<[tru]e> but was:<[fals]e>
Caused by: org.junit.ComparisonFailure: expected:<[tru]e> but was:<[fals]e>
	at sun.reflect.NativeConstructorAccessorImpl.newInstance0(Native Method)
	at sun.reflect.NativeConstructorAccessorImpl.newInstance(NativeConstructorAccessorImpl.java:62)
	at sun.reflect.DelegatingConstructorAccessorImpl.newInstance(DelegatingConstructorAccessorImpl.java:45)
	at reactor.netty.tcp.TcpResourcesTest.lambda$disposeLaterDefers$0(TcpResourcesTest.java:96)
	at reactor.core.publisher.MonoPeekTerminal$MonoTerminalPeekSubscriber.onComplete(MonoPeekTerminal.java:311)
(53 more lines...)
Collapse Failed UdpServerTests supportsUdpMulticast History
Netty 5 secs
java.lang.AssertionError: java.lang.AssertionError: latch was not counted down enough: 2 left on 6
java.lang.AssertionError: latch was not counted down enough: 2 left on 6
	at org.hamcrest.MatcherAssert.assertThat(MatcherAssert.java:26)
	at reactor.netty.udp.UdpServerTests.supportsUdpMulticast(UdpServerTests.java:199)
	at sun.reflect.NativeMethodAccessorImpl.invoke0(Native Method)
	at sun.reflect.NativeMethodAccessorImpl.invoke(NativeMethodAccessorImpl.java:62)
	at sun.reflect.DelegatingMethodAccessorImpl.invoke(DelegatingMethodAccessorImpl.java:43)
	at java.lang.reflect.Method.invoke(Method.java:498)
(43 more lines...)