Build #1,329

Build result summary

Details

Completed
Duration
2 minutes
Labels
None
Agent
bamboo-12.af.pivotal.io
Revision
4462532822dd13dc6214dc002229e34c3e9b05e9 4462532822dd13dc6214dc002229e34c3e9b05e9
Total tests
295
Fixed in
#1330 (Changes by violetagg <milesg78@gmail.com>)

Responsible

No one has taken responsibility for this failure

Code commits

Author Commit Message Commit date
Stephane Maldini <smaldini@pivotal.io> Stephane Maldini <smaldini@pivotal.io> 4462532822dd13dc6214dc002229e34c3e9b05e9 4462532822dd13dc6214dc002229e34c3e9b05e9 Fix event HttpClient lifecycle

Tests

New test failures 1
Status Test View job Duration
Collapse Failed HttpClientTest sslExchangeRelativeGet History
Netty < 1 sec
java.lang.IllegalStateException: java.lang.IllegalStateException: Timeout on blocking read for 200 MILLISECONDS
java.lang.IllegalStateException: Timeout on blocking read for 200 MILLISECONDS
	at reactor.core.publisher.BlockingSingleSubscriber.blockingGet(BlockingSingleSubscriber.java:117)
	at reactor.core.publisher.Mono.block(Mono.java:1498)
	at reactor.netty.http.client.HttpClientTest.sslExchangeRelativeGet(HttpClientTest.java:787)
	at sun.reflect.NativeMethodAccessorImpl.invoke0(Native Method)
	at sun.reflect.NativeMethodAccessorImpl.invoke(NativeMethodAccessorImpl.java:62)
	at sun.reflect.DelegatingMethodAccessorImpl.invoke(DelegatingMethodAccessorImpl.java:43)
(44 more lines...)